Smokin' Guns build error?

Trying to install game Smokin" Guns , but i get build error .
I have installed in the past with no problems .
Today I started to install some games and all seems to have gone well . At some point I beleive I may have done updates . Never the less , I tried to install America’s Army and build error happened . I knew that Smokin’ Guns should work as I have installed on other laptop . Unfortunitly the same error happened .
Here is what comes up at end of build :
ake[2]: Leaving directory ‘/home/northernfrog/.cache/yay/smokinguns-git/src/smokinguns’
make[1]: *** [Makefile:1285: targets] Error 2
make[1]: Leaving directory ‘/home/northernfrog/.cache/yay/smokinguns-git/src/smokinguns’
make: *** [Makefile:1223: release] Error 2
==> ERROR: A failure occurred in build().

I’m I missing a build package ?

The error message is above the part you have included. Look for something which specifically says error:, or post the full log to a pastebin site.

1 Like

Trying to install again , will report back .

Sorry about the wait , slow internet .
Here is were I see the first error :
ebufferEXT’; ./build/release-linux-x86_64/renderergl2/tr_extensions.o:(.bss+0x10): first defined here
collect2: error: ld returned 1 exit status
make[2]: *** [Makefile:2115: build/release-linux-x86_64/renderer_opengl2_x86_64.so] Error 1
rm build/release-linux-x86_64/renderergl2/glsl/tonemap_vp.c build/release-linux-x86_64/renderergl2/glsl/ssao_vp.c build/release-linux-x86_64/renderergl2/glsl/shadowfill_fp.c build/release-linux-x86_64/renderergl2/glsl/calclevels4x_vp.c build/release-linux-x86_64/renderergl2/glsl/fogpass_fp.c build/release-linux-x86_64/renderergl2/glsl/fogpass_vp.c build/release-linux-x86_64/renderergl2/glsl/generic_vp.c build/release-linux-x86_64/renderergl2/glsl/calclevels4x_fp.c build/release-linux-x86_64/renderergl2/glsl/shadowmask_vp.c build/release-linux-x86_64/renderergl2/glsl/bokeh_fp.c build/release-linux-x86_64/renderergl2/glsl/bokeh_vp.c build/release-linux-x86_64/renderergl2/glsl/dlight_fp.c build/release-linux-x86_64/renderergl2/glsl/dlight_vp.c build/release-linux-x86_64/renderergl2/glsl/lightall_vp.c build/release-linux-x86_64/renderergl2/glsl/pshadow_vp.c build/release-linux-x86_64/renderergl2/glsl/tonemap_fp.c build/release-linux-x86_64/renderergl2/glsl/texturecolor_fp.c build/release-linux-x86_64/renderergl2/glsl/generic_fp.c build/release-linux-x86_64/renderergl2/glsl/down4x_vp.c build/release-linux-x86_64/renderergl2/glsl/shadowmask_fp.c build/release-linux-x86_64/renderergl2/glsl/ssao_fp.c build/release-linux-x86_64/renderergl2/glsl/down4x_fp.c build/release-linux-x86_64/renderergl2/glsl/pshadow_fp.c build/release-linux-x86_64/renderergl2/glsl/depthblur_fp.c build/release-linux-x86_64/renderergl2/glsl/lightall_fp.c build/release-linux-x86_64/renderergl2/glsl/texturecolor_vp.c build/release-linux-x86_64/renderergl2/glsl/depthblur_vp.c build/release-linux-x86_64/renderergl2/glsl/shadowfill_vp.c
make[2]: Leaving directory ‘/home/northernfrog/.cache/yay/smokinguns-git/src/smokinguns’
make[1]: *** [Makefile:1285: targets] Error 2
make[1]: Leaving directory ‘/home/northernfrog/.cache/yay/smokinguns-git/src/smokinguns’
make: *** [Makefile:1223: release] Error 2
==> ERROR: A failure occurred in build().
Aborting…
error making: %!s(func() string=0x55a4f4125a60)
[northernfrog@northernfrog-oryxpro ~]$

Hope this is the info you needed ?

ebufferEXT’; ./build/release-linux-x86_64/renderergl2/tr_extensions.o:(.bss+0x10): first defined here
collect2: error: ld returned 1 exit status
make[2]: *** [Makefile:2115: build/release-linux-x86_64/renderer_opengl2_x86_64.so] Error 1
rm build/release-linux-x86_64/renderergl2/glsl/tonemap_vp.c build/release-linux-x86_64/renderergl2/glsl/ssao_vp.c build/release-linux-x86_64/renderergl2/glsl/shadowfill_fp.c build/release-linux-x86_64/renderergl2/glsl/calclevels4x_vp.c build/release-linux-x86_64/renderergl2/glsl/fogpass_fp.c build/release-linux-x86_64/renderergl2/glsl/fogpass_vp.c build/release-linux-x86_64/renderergl2/glsl/generic_vp.c build/release-linux-x86_64/renderergl2/glsl/calclevels4x_fp.c build/release-linux-x86_64/renderergl2/glsl/shadowmask_vp.c build/release-linux-x86_64/renderergl2/glsl/bokeh_fp.c build/release-linux-x86_64/renderergl2/glsl/bokeh_vp.c build/release-linux-x86_64/renderergl2/glsl/dlight_fp.c build/release-linux-x86_64/renderergl2/glsl/dlight_vp.c build/release-linux-x86_64/renderergl2/glsl/lightall_vp.c build/release-linux-x86_64/renderergl2/glsl/pshadow_vp.c build/release-linux-x86_64/renderergl2/glsl/tonemap_fp.c build/release-linux-x86_64/renderergl2/glsl/texturecolor_fp.c build/release-linux-x86_64/renderergl2/glsl/generic_fp.c build/release-linux-x86_64/renderergl2/glsl/down4x_vp.c build/release-linux-x86_64/renderergl2/glsl/shadowmask_fp.c build/release-linux-x86_64/renderergl2/glsl/ssao_fp.c build/release-linux-x86_64/renderergl2/glsl/down4x_fp.c build/release-linux-x86_64/renderergl2/glsl/pshadow_fp.c build/release-linux-x86_64/renderergl2/glsl/depthblur_fp.c build/release-linux-x86_64/renderergl2/glsl/lightall_fp.c build/release-linux-x86_64/renderergl2/glsl/texturecolor_vp.c build/release-linux-x86_64/renderergl2/glsl/depthblur_vp.c build/release-linux-x86_64/renderergl2/glsl/shadowfill_vp.c
make[2]: Leaving directory ‘/home/northernfrog/.cache/yay/smokinguns-git/src/smokinguns’
make[1]: *** [Makefile:1285: targets] Error 2
make[1]: Leaving directory ‘/home/northernfrog/.cache/yay/smokinguns-git/src/smokinguns’
make: *** [Makefile:1223: release] Error 2
==> ERROR: A failure occurred in build().
Aborting…
error making: %!s(func() string=0x55a4f4125a60)
[northernfrog@northernfrog-oryxpro ~]$
echo $a |grep error                                                                                                                      
collect2: error: ld returned 1 exit status
error making: %!s(func() string=0x55a4f4125a60)

The source code:

hasn’t been updated since 2014 so may need updating for current compilers and libraries.

So, if compilation fails it might be worth trying one of the available downloads:

https://www.smokin-guns.org/downloads

(Download, extract, set executable, run.)

2 Likes

Thank you. Will give that a try !

Sorry about late reply , but power went out . Just came back 5 min. ago .

I tried with no sucess , I give up ! Not worth the head-ache … Gonna move on and try some other FPS games . Newer computer means newer games . Only played Smokin’guns because it was the only FPS that worked on older laptop .
Just find it weird it installed on other laptop about 3 to 4 months ago .
Anyways Thank You !