Stampante canon ts 7450a

buonasera
Installato systema nuovo ,ho un probema sull’istallazione della stampante canon ts7450a ,installando con pacchetto aur cnijfilter-ts7450series mi restituisce un errore
e non viene riconosciuta , col Cassini Neo non succedeva
grazie

keytext.c:311:9: note: include ‘<stdlib.h>’ or provide a declaration of ‘free’
make[2]: *** [Makefile:427: keytext.o] Error 1
make[2]: uscita dalla directory «/var/cache/private/yay/cnijfilter-ts7450series/src/cnijfilter2-source-6.10-1/lgmon3/src»
make[1]: *** [Makefile:416: all-recursive] Error 1
make[1]: uscita dalla directory «/var/cache/private/yay/cnijfilter-ts7450series/src/cnijfilter2-source-6.10-1/lgmon3»
make: *** [Makefile:348: all] Error 2
==> ERRORE: Si è verificato un errore in build().
L’operazione sta per essere interrotta…
→ errore durante la creazione: cnijfilter-ts7450series-exit status 4
→ Installazione dei seguenti pacchetti non riuscita. È richiesto l’intervento manuale:
cnijfilter-ts7450series - exit status 4

Hi,

First of all, it would be nicer if you would try to speak english on english speaking forum. You know, we have google translate and AI in XXI century.

I also was not able to install it, I get this error:

mv -f .deps/cnijifusb.Tpo .deps/cnijifusb.Po
mv -f .deps/cnijifnet2.Tpo .deps/cnijifnet2.Po
mv -f .deps/cnijlgmon3.Tpo .deps/cnijlgmon3.Po
make[2]: Leaving directory '/home/jakub/.cache/paru/clone/cnijfilter-ts7450series/src/cnijfilter2-source-6.10-1/lgmon3/src'
make[1]: *** [Makefile:416: all-recursive] Error 1
make[1]: Leaving directory '/home/jakub/.cache/paru/clone/cnijfilter-ts7450series/src/cnijfilter2-source-6.10-1/lgmon3'
make: *** [Makefile:348: all] Error 2
==> ERROR: A failure occurred in build().
    Aborting...
error: failed to build 'cnijfilter-ts7450series-6.10-1': 
error: packages failed to build: cnijfilter-ts7450series-6.10-1
mv -f .deps/cnijifusb.Tpo .deps/cnijifusb.Po
mv -f .deps/cnijifnet2.Tpo .deps/cnijifnet2.Po
mv -f .deps/cnijlgmon3.Tpo .deps/cnijlgmon3.Po
make[2]: Leaving directory '/home/jakub/.cache/paru/clone/cnijfilter-ts7450series/src/cnijfilter2-source-6.10-1/lgmon3/src'
make[1]: *** [Makefile:416: all-recursive] Error 1
make[1]: Leaving directory '/home/jakub/.cache/paru/clone/cnijfilter-ts7450series/src/cnijfilter2-source-6.10-1/lgmon3'
make: *** [Makefile:348: all] Error 2
==> ERROR: A failure occurred in build().
    Aborting...
error: failed to build 'cnijfilter-ts7450series-6.10-1': 
error: packages failed to build: cnijfilter-ts7450series-6.10-1
mv -f .deps/cnijifusb.Tpo .deps/cnijifusb.Po
mv -f .deps/cnijifnet2.Tpo .deps/cnijifnet2.Po
mv -f .deps/cnijlgmon3.Tpo .deps/cnijlgmon3.Po
make[2]: Leaving directory '/home/jakub/.cache/paru/clone/cnijfilter-ts7450series/src/cnijfilter2-source-6.10-1/lgmon3/src'
make[1]: *** [Makefile:416: all-recursive] Error 1
make[1]: Leaving directory '/home/jakub/.cache/paru/clone/cnijfilter-ts7450series/src/cnijfilter2-source-6.10-1/lgmon3'
make: *** [Makefile:348: all] Error 2
==> ERROR: A failure occurred in build().
    Aborting...
error: failed to build 'cnijfilter-ts7450series-6.10-1': 
error: packages failed to build: cnijfilter-ts7450series-6.10-1

Your best chance at this point is it to leave comment here: https://aur.archlinux.org/packages/cnijfilter-ts7450series and pray that lesebas will want to take a look.

Ciao!

If you translate Italian into English and vice versa, the sentence takes on a totally different meaning, but if you translate my sentence once, everything is correct

I solved the problem by installing
canon-pixma-ts5055-complete of AUR

Thanks

Dimenticavo tutto questo con l’aiuto dell AI del X1X secolo ,
hai fatto il fenomeno ma non hai dato la soluzione .

te lo traduco : forgot all this with the help of the 19th century AI,
you did the phenomenon but you didn’t give the solution.

This topic was automatically closed 2 days after the last reply. New replies are no longer allowed.