Goldendict, installation failed, qt5-webkit

Hello,
I need to install one last GUI for the bible dictionaries that I have, it is called Goldendict, it is not in the system and yay does not finish building it, it stops saying that a dependency is missing or something like that, but I can’t get it either, if someone can please tell me how to install this package in Endeavouros I would be very grateful, thanks.

[alnone@alnone-inspiron3583 ~]$ LANG=C yay -S goldendict
AUR Explicit (1): goldendict-1:1.5.0-3
AUR Dependency (1): qt5-webkit-5.212.0alpha4-22
:: PKGBUILD up to date, skipping download: goldendict
:: PKGBUILD up to date, skipping download: qt5-webkit
  2 goldendict                       (Build Files Exist)
  1 qt5-webkit                       (Build Files Exist)
==> Packages to cleanBuild?
==> [N]one [A]ll [Ab]ort [I]nstalled [No]tInstalled or (1 2 3, 1-3, ^4)
==> N
  2 goldendict                       (Build Files Exist)
  1 qt5-webkit                       (Build Files Exist)
==> Diffs to show?
==> [N]one [A]ll [Ab]ort [I]nstalled [No]tInstalled or (1 2 3, 1-3, ^4)
==> A
 -> goldendict: No changes -- skipping
 -> qt5-webkit: No changes -- skipping

:: Proceed with install? [Y/n] y
==> Making package: goldendict 1:1.5.0-3 (Wed 20 Mar 2024 11:25:17 AM EDT)
==> Retrieving sources...
  -> Found goldendict-1.5.0.tar.gz
==> WARNING: Skipping verification of source file PGP signatures.
==> Validating source files with sha256sums...
    goldendict-1.5.0.tar.gz ... Passed
==> Making package: qt5-webkit 5.212.0alpha4-22 (Wed 20 Mar 2024 11:25:18 AM EDT)
==> Retrieving sources...
  -> Found qtwebkit-5.212.0-alpha4.tar.xz
  -> Found qtwebkit-cstdint.patch
  -> Found icu68.patch
  -> Found glib-2.68.patch
  -> Found qt5-webkit-python-3.9.patch
  -> Found qt5-webkit-bison-3.7.patch
==> WARNING: Skipping verification of source file PGP signatures.
==> Validating source files with sha256sums...
    qtwebkit-5.212.0-alpha4.tar.xz ... Passed
    qtwebkit-cstdint.patch ... Passed
    icu68.patch ... Passed
    glib-2.68.patch ... Passed
    qt5-webkit-python-3.9.patch ... Passed
    qt5-webkit-bison-3.7.patch ... Passed
:: (1/2) Parsing SRCINFO: goldendict
:: (2/2) Parsing SRCINFO: qt5-webkit
==> Making package: qt5-webkit 5.212.0alpha4-22 (Wed 20 Mar 2024 11:25:18 AM EDT)
==> Checking runtime dependencies...
==> Checking buildtime dependencies...
==> Retrieving sources...
  -> Found qtwebkit-5.212.0-alpha4.tar.xz
  -> Found qtwebkit-cstdint.patch
  -> Found icu68.patch
  -> Found glib-2.68.patch
  -> Found qt5-webkit-python-3.9.patch
  -> Found qt5-webkit-bison-3.7.patch
==> Validating source files with sha256sums...
    qtwebkit-5.212.0-alpha4.tar.xz ... Passed
    qtwebkit-cstdint.patch ... Passed
    icu68.patch ... Passed
    glib-2.68.patch ... Passed
    qt5-webkit-python-3.9.patch ... Passed
    qt5-webkit-bison-3.7.patch ... Passed
==> Removing existing $srcdir/ directory...
==> Extracting sources...
  -> Extracting qtwebkit-5.212.0-alpha4.tar.xz with bsdtar
==> Starting prepare()...
patching file Source/WebCore/platform/text/TextCodecICU.cpp
patching file Source/WebCore/platform/text/icu/UTextProvider.h
patching file Source/WebCore/platform/text/icu/UTextProviderLatin1.cpp
patching file Source/WebCore/platform/text/icu/UTextProviderUTF16.cpp
patching file Source/WTF/wtf/glib/GRefPtr.h
Hunk #1 succeeded at 29 with fuzz 2.
patching file Source/JavaScriptCore/generate-bytecode-files
patching file Source/WebCore/css/makegrammar.pl
patching file Source/ThirdParty/ANGLE/src/common/mathutil.h
==> Sources are ready.
==> Making package: qt5-webkit 5.212.0alpha4-22 (Wed 20 Mar 2024 11:25:21 AM EDT)
==> Checking runtime dependencies...
==> Checking buildtime dependencies...
==> WARNING: Using existing $srcdir/ tree
==> Removing existing $pkgdir/ directory...
==> Starting build()...
-- The C compiler identification is GNU 13.2.1
-- The CXX compiler identification is GNU 13.2.1
-- Detecting C compiler ABI info
-- Detecting C compiler ABI info - done
-- Check for working C compiler: /usr/bin/cc - skipped
-- Detecting C compile features
-- Detecting C compile features - done
-- Detecting CXX compiler ABI info
-- Detecting CXX compiler ABI info - done
-- Check for working CXX compiler: /usr/bin/c++ - skipped
-- Detecting CXX compile features
-- Detecting CXX compile features - done
-- Found BISON: /usr/bin/bison (found suitable version "3.8.2", minimum required is "2.1") 
-- Found Gperf: /usr/bin/gperf (Required is at least version "3.0.1") 
-- Found Perl: /usr/bin/perl (found suitable version "5.38.2", minimum required is "5.10.0") 
-- Found PythonInterp: /usr/bin/python3 (found suitable version "3.11.8", minimum required is "2.7.0") 
-- Found Ruby: /usr/bin/ruby (found suitable version "3.0.6", minimum required is "1.9") 
-- Looking for include file features.h
-- Looking for include file features.h - found
-- Found PkgConfig: /usr/bin/pkg-config (found version "2.1.1") 
-- Checking for module 'sqlite3'
--   Found sqlite3, version 3.45.2
-- Found Sqlite: /usr/include  
-- Performing Test CMAKE_HAVE_LIBC_PTHREAD
-- Performing Test CMAKE_HAVE_LIBC_PTHREAD - Success
-- Found Threads: TRUE  
-- Found JPEG: /usr/lib/libjpeg.so (found version "80") 
-- Found ZLIB: /usr/lib/libz.so (found version "1.3.1")  
-- Found PNG: /usr/lib/libpng.so (found version "1.6.43") 
-- Checking for module 'icu-uc'
--   Found icu-uc, version 74.2
-- Checking for module 'icu-i18n'
--   Found icu-i18n, version 74.2
-- Found ICU header files in /usr/include
-- Found ICU libraries: /usr/lib/libicuuc.so
-- Found LibXml2: /usr/lib/libxml2.so (found suitable version "2.12.6", minimum required is "2.8.0") 
-- Could NOT find Dwz (missing: DWZ_EXECUTABLE) (Required is at least version "0.13")
-- Found WebP: /usr/include  
-- Qt OpenGL implementation: GL
-- Qt OpenGL libraries: Qt5::Gui_GL
-- Qt EGL libraries: Qt5::Gui_EGL
-- Performing Test Qt5Gui_PRIVATE_HEADER_FOUND
-- Performing Test Qt5Gui_PRIVATE_HEADER_FOUND - Success
-- Performing Test Qt5Network_PRIVATE_HEADER_FOUND
-- Performing Test Qt5Network_PRIVATE_HEADER_FOUND - Success
-- Performing Test Qt5Quick_PRIVATE_HEADER_FOUND
-- Performing Test Qt5Quick_PRIVATE_HEADER_FOUND - Success
-- Found X11: /usr/include   
-- Looking for XOpenDisplay in /usr/lib/libX11.so;/usr/lib/libXext.so
-- Looking for XOpenDisplay in /usr/lib/libX11.so;/usr/lib/libXext.so - found
-- Looking for gethostbyname
-- Looking for gethostbyname - found
-- Looking for connect
-- Looking for connect - found
-- Looking for remove
-- Looking for remove - found
-- Looking for shmat
-- Looking for shmat - found
-- Looking for IceConnectionNumber in ICE
-- Looking for IceConnectionNumber in ICE - found
-- Found GLIB: /usr/include/glib-2.0;/usr/lib/glib-2.0/include (found suitable version "2.78.4", minimum required is "2.36") 
-- Checking for module 'gstreamer-1.0 >= 1.0.3'
--   Found gstreamer-1.0, version 1.24.0
-- Checking for module 'gstreamer-base-1.0 >= 1.0.3'
--   Found gstreamer-base-1.0, version 1.24.0
-- Checking for module 'gstreamer-app-1.0 >= 1.0.3'
--   Found gstreamer-app-1.0, version 1.24.0
-- Checking for module 'gstreamer-audio-1.0 >= 1.0.3'
--   Found gstreamer-audio-1.0, version 1.24.0
-- Checking for module 'gstreamer-fft-1.0 >= 1.0.3'
--   Found gstreamer-fft-1.0, version 1.24.0
-- Checking for module 'gstreamer-gl-1.0>=1.6.0'
--   Found gstreamer-gl-1.0, version 1.24.0
-- Checking for module 'gstreamer-mpegts-1.0>=1.4.0'
--   Found gstreamer-mpegts-1.0, version 1.24.0
-- Checking for module 'gstreamer-pbutils-1.0 >= 1.0.3'
--   Found gstreamer-pbutils-1.0, version 1.24.0
-- Checking for module 'gstreamer-tag-1.0 >= 1.0.3'
--   Found gstreamer-tag-1.0, version 1.24.0
-- Checking for module 'gstreamer-video-1.0 >= 1.0.3'
--   Found gstreamer-video-1.0, version 1.24.0
-- Found GStreamer: GSTREAMER_INCLUDE_DIRS;GSTREAMER_LIBRARIES;GSTREAMER_VERSION;GSTREAMER_BASE_INCLUDE_DIRS;GSTREAMER_BASE_LIBRARIES;GSTREAMER_APP_INCLUDE_DIRS;GSTREAMER_APP_LIBRARIES;GSTREAMER_PBUTILS_INCLUDE_DIRS;GSTREAMER_PBUTILS_LIBRARIES;GSTREAMER_VIDEO_INCLUDE_DIRS;GSTREAMER_VIDEO_LIBRARIES;GSTREAMER_MPEGTS_INCLUDE_DIRS;GSTREAMER_MPEGTS_LIBRARIES;GSTREAMER_TAG_INCLUDE_DIRS;GSTREAMER_TAG_LIBRARIES;GSTREAMER_GL_INCLUDE_DIRS;GSTREAMER_GL_LIBRARIES;GSTREAMER_AUDIO_INCLUDE_DIRS;GSTREAMER_AUDIO_LIBRARIES;GSTREAMER_FFT_INCLUDE_DIRS;GSTREAMER_FFT_LIBRARIES (Required is at least version "1.0.3") 
-- Found Hyphen: /usr/include  
-- Checking for module 'libwoff2dec'
--   Found libwoff2dec, version 1.0.2
-- Found WOFF2Dec: /usr/include (found suitable version "1.0.2", minimum required is "1.0.1") 
-- Using system WOFF2Dec library.
-- The following OPTIONAL packages have been found:

 * JPEG
 * WebP
 * Qt5OpenGL (required version >= 5.2.0)
 * PkgConfig
 * WOFF2Dec (required version >= 1.0.1)

-- The following REQUIRED packages have been found:

 * BISON (required version >= 2.1)
 * Gperf (required version >= 3.0.1)
 * Perl (required version >= 5.10.0)
 * PythonInterp (required version >= 2.7.0)
 * Ruby (required version >= 1.9)
 * Sqlite
 * Threads
 * PNG
 * ZLIB
 * ICU
 * LibXml2 (required version >= 2.8.0)
 * Qt5Core
 * Qt5Gui
 * Qt5Network
 * Qt5Widgets
 * Qt5Test
 * Qt5QuickTest
 * Qt5Positioning
 * Qt5Sensors
 * Qt5PrintSupport
   Required for ENABLE_PRINT_SUPPORT=ON
 * Qt5Qml (required version >= 5.15.13)
 * Qt5QmlModels (required version >= 5.15.13)
 * Qt5Quick
 * Qt5WebChannel
 * Qt5 (required version >= 5.2.0)
 * X11
 * GLIB (required version >= 2.36)
 * GStreamer (required version >= 1.0.3)
 * Hyphen

-- The following OPTIONAL packages have not been found:

 * Dwz (required version >= 0.13)

-- Installing in the same prefix as Qt, adopting their path scheme.
-- Using platform-specific CMakeLists: /home/alnone/.cache/yay/qt5-webkit/src/qtwebkit-5.212.0-alpha4/Source/WTF/wtf/PlatformQt.cmake
-- Looking for clock_gettime
-- Looking for clock_gettime - found
-- Using platform-specific CMakeLists: /home/alnone/.cache/yay/qt5-webkit/src/qtwebkit-5.212.0-alpha4/Source/JavaScriptCore/PlatformQt.cmake
-- Using platform-specific CMakeLists: /home/alnone/.cache/yay/qt5-webkit/src/qtwebkit-5.212.0-alpha4/Source/JavaScriptCore/shell/PlatformQt.cmake
-- All-in-One build is enabled.
-- Using platform-specific CMakeLists: /home/alnone/.cache/yay/qt5-webkit/src/qtwebkit-5.212.0-alpha4/Source/WebCore/PlatformQt.cmake
-- Using platform-specific CMakeLists: /home/alnone/.cache/yay/qt5-webkit/src/qtwebkit-5.212.0-alpha4/Source/WebKit/PlatformQt.cmake
-- Performing Test ATOMIC_INT64_IS_BUILTIN
-- Performing Test ATOMIC_INT64_IS_BUILTIN - Success
-- Looking for shm_open
-- Looking for shm_open - found
-- Using platform-specific CMakeLists: /home/alnone/.cache/yay/qt5-webkit/src/qtwebkit-5.212.0-alpha4/Source/WebKit2/PlatformQt.cmake
-- Using platform-specific CMakeLists: /home/alnone/.cache/yay/qt5-webkit/src/qtwebkit-5.212.0-alpha4/Source/PlatformQt.cmake
-- Enabled features:
--  ENABLE_ACCELERATED_2D_CANVAS ............ ON
--  ENABLE_ALLINONE_BUILD                     ON
--  ENABLE_API_TESTS ........................ ON
--  ENABLE_CSS_GRID_LAYOUT                    ON
--  ENABLE_DATABASE_PROCESS ................. ON
--  ENABLE_DATALIST_ELEMENT                   ON
--  ENABLE_DEVICE_ORIENTATION ............... ON
--  ENABLE_DRAG_SUPPORT                       ON
--  ENABLE_FULLSCREEN_API ................... ON
--  ENABLE_GAMEPAD_DEPRECATED                 ON
--  ENABLE_GEOLOCATION ...................... ON
--  ENABLE_ICONDATABASE                       ON
--  ENABLE_INDEXED_DATABASE ................. ON
--  ENABLE_INSPECTOR_UI                       ON
--  ENABLE_JIT .............................. ON
--  ENABLE_LEGACY_WEB_AUDIO                   ON
--  ENABLE_LINK_PREFETCH .................... ON
--  ENABLE_MEDIA_SOURCE                       ON
--  ENABLE_NETSCAPE_PLUGIN_API .............. ON
--  ENABLE_OPENGL                             ON
--  ENABLE_PRINT_SUPPORT .................... ON
--  ENABLE_QT_GESTURE_EVENTS                  ON
--  ENABLE_QT_WEBCHANNEL .................... ON
--  ENABLE_SAMPLING_PROFILER                  ON
--  ENABLE_SPELLCHECK ....................... ON
--  ENABLE_TOUCH_EVENTS                       ON
--  ENABLE_VIDEO ............................ ON
--  ENABLE_WEBKIT2                            ON
--  ENABLE_WEB_AUDIO ........................ ON
--  ENABLE_X11_TARGET                         ON
--  ENABLE_XSLT ............................. OFF
--  USE_GSTREAMER                             ON
--  USE_LIBHYPHEN ........................... ON
--  USE_LIBJPEG                               ON
--  USE_MEDIA_FOUNDATION .................... OFF
--  USE_QT_MULTIMEDIA                         OFF
--  USE_SYSTEM_MALLOC ....................... OFF
--  USE_WOFF2                                 ON
-- Configuring done (10.4s)
-- Generating done (0.6s)
-- Build files have been written to: /home/alnone/.cache/yay/qt5-webkit/src/build
[  0%] Built target WebKit2-forwarding-headers
[  0%] Generating ../../DerivedSources/ForwardingHeaders/JavaScriptCore/Scripts/UpdateContents.py
[  0%] Generating ../../DerivedSources/ForwardingHeaders/JavaScriptCore/Scripts/builtins_generate_combined_header.py
[  0%] Generating ../../DerivedSources/ForwardingHeaders/JavaScriptCore/Scripts/builtins_generate_combined_implementation.py
[  0%] Generating ../../DerivedSources/ForwardingHeaders/JavaScriptCore/Scripts/builtins_generate_separate_header.py
[  0%] Generating ../../DerivedSources/ForwardingHeaders/JavaScriptCore/Scripts/builtins_generate_separate_implementation.py
[  0%] Generating ../../DerivedSources/ForwardingHeaders/JavaScriptCore/Scripts/builtins_generator.py
[  0%] Generating ../../DerivedSources/ForwardingHeaders/JavaScriptCore/Scripts/builtins_model.py
[  0%] Generating ../../DerivedSources/ForwardingHeaders/JavaScriptCore/Scripts/builtins_templates.py
[  0%] Generating ../../DerivedSources/ForwardingHeaders/JavaScriptCore/Scripts/cssmin.py
[  0%] Generating ../../DerivedSources/ForwardingHeaders/JavaScriptCore/Scripts/generate-combined-inspector-json.py
[  0%] Generating ../../DerivedSources/ForwardingHeaders/JavaScriptCore/Scripts/generate-js-builtins.py
[  0%] Generating ../../DerivedSources/ForwardingHeaders/JavaScriptCore/Scripts/inline-and-minify-stylesheets-and-scripts.py
[  0%] Generating ../../DerivedSources/ForwardingHeaders/JavaScriptCore/Scripts/jsmin.py
[  0%] Generating ../../DerivedSources/ForwardingHeaders/JavaScriptCore/Scripts/lazywriter.py
[  0%] Generating ../../DerivedSources/ForwardingHeaders/JavaScriptCore/Scripts/make-js-file-arrays.py
[  0%] Generating ../../DerivedSources/ForwardingHeaders/JavaScriptCore/Scripts/wkbuiltins.py
[  0%] Generating ../../DerivedSources/ForwardingHeaders/JavaScriptCore/Scripts/xxd.pl
[  0%] Built target stageSharedScripts
[  0%] Building CXX object Source/bmalloc/CMakeFiles/bmalloc.dir/bmalloc/Allocator.cpp.o
[  0%] Building CXX object Source/bmalloc/CMakeFiles/bmalloc.dir/bmalloc/Cache.cpp.o
[  0%] Building CXX object Source/bmalloc/CMakeFiles/bmalloc.dir/bmalloc/Deallocator.cpp.o
[  0%] Building CXX object Source/bmalloc/CMakeFiles/bmalloc.dir/bmalloc/Environment.cpp.o
[  0%] Building CXX object Source/bmalloc/CMakeFiles/bmalloc.dir/bmalloc/Heap.cpp.o
[  0%] Building CXX object Source/bmalloc/CMakeFiles/bmalloc.dir/bmalloc/Logging.cpp.o
[  0%] Building CXX object Source/bmalloc/CMakeFiles/bmalloc.dir/bmalloc/ObjectType.cpp.o
[  0%] Building CXX object Source/bmalloc/CMakeFiles/bmalloc.dir/bmalloc/StaticMutex.cpp.o
[  0%] Building CXX object Source/bmalloc/CMakeFiles/bmalloc.dir/bmalloc/VMHeap.cpp.o
[  0%] Building CXX object Source/bmalloc/CMakeFiles/bmalloc.dir/bmalloc/XLargeMap.cpp.o
[  0%] Building CXX object Source/bmalloc/CMakeFiles/bmalloc.dir/bmalloc/mbmalloc.cpp.o
[  1%] Linking CXX static library ../../lib/libbmalloc.a
[  1%] Built target bmalloc
[  2%] Generating WorkQueueQt.moc
[  2%] Generating MainThreadQt.moc
[  2%] Generating RunLoopQt.moc
[  2%] Building CXX object Source/WTF/wtf/CMakeFiles/WTF.dir/Assertions.cpp.o
[  2%] Building CXX object Source/WTF/wtf/CMakeFiles/WTF.dir/Atomics.cpp.o
[  2%] Building CXX object Source/WTF/wtf/CMakeFiles/WTF.dir/BitVector.cpp.o
[  2%] Building CXX object Source/WTF/wtf/CMakeFiles/WTF.dir/CompilationThread.cpp.o
[  2%] Building CXX object Source/WTF/wtf/CMakeFiles/WTF.dir/CryptographicUtilities.cpp.o
[  2%] Building CXX object Source/WTF/wtf/CMakeFiles/WTF.dir/CryptographicallyRandomNumber.cpp.o
[  2%] Building CXX object Source/WTF/wtf/CMakeFiles/WTF.dir/CurrentTime.cpp.o
[  2%] Building CXX object Source/WTF/wtf/CMakeFiles/WTF.dir/DataLog.cpp.o
[  2%] Building CXX object Source/WTF/wtf/CMakeFiles/WTF.dir/DateMath.cpp.o
[  2%] Building CXX object Source/WTF/wtf/CMakeFiles/WTF.dir/DecimalNumber.cpp.o
[  2%] Building CXX object Source/WTF/wtf/CMakeFiles/WTF.dir/FastBitVector.cpp.o
[  2%] Building CXX object Source/WTF/wtf/CMakeFiles/WTF.dir/FastMalloc.cpp.o
In file included from /home/alnone/.cache/yay/qt5-webkit/src/qtwebkit-5.212.0-alpha4/Source/WTF/wtf/StdLibExtras.h:33,
                 from /home/alnone/.cache/yay/qt5-webkit/src/qtwebkit-5.212.0-alpha4/Source/WTF/wtf/FastMalloc.h:26,
                 from /home/alnone/.cache/yay/qt5-webkit/src/qtwebkit-5.212.0-alpha4/Source/WTF/config.h:51,
                 from /home/alnone/.cache/yay/qt5-webkit/src/qtwebkit-5.212.0-alpha4/Source/WTF/wtf/FastMalloc.cpp:27:
/home/alnone/.cache/yay/qt5-webkit/src/qtwebkit-5.212.0-alpha4/Source/WTF/wtf/CheckedArithmetic.h: In instantiation of 'const WTF::Checked<T, OverflowHandler> WTF::Checked<T, OverflowHandler>::operator*=(U) [with U = long unsigned int; T = long unsigned int; OverflowHandler = WTF::CrashOnOverflow]':
/home/alnone/.cache/yay/qt5-webkit/src/qtwebkit-5.212.0-alpha4/Source/WTF/wtf/FastMalloc.cpp:199:20:   required from here
/home/alnone/.cache/yay/qt5-webkit/src/qtwebkit-5.212.0-alpha4/Source/WTF/wtf/CheckedArithmetic.h:597:17: warning: implicitly-declared 'constexpr WTF::Checked<long unsigned int>::Checked(const WTF::Checked<long unsigned int>&)' is deprecated [-Wdeprecated-copy]
  597 |         return *this;
      |                 ^~~~
/home/alnone/.cache/yay/qt5-webkit/src/qtwebkit-5.212.0-alpha4/Source/WTF/wtf/CheckedArithmetic.h:496:20: note: because 'WTF::Checked<long unsigned int>' has user-provided 'const WTF::Checked<T, OverflowHandler>& WTF::Checked<T, OverflowHandler>::operator=(WTF::Checked<T, OverflowHandler>) [with T = long unsigned int; OverflowHandler = WTF::CrashOnOverflow]'
  496 |     const Checked& operator=(Checked rhs)
      |                    ^~~~~~~~
/home/alnone/.cache/yay/qt5-webkit/src/qtwebkit-5.212.0-alpha4/Source/WTF/wtf/CheckedArithmetic.h: In instantiation of 'const WTF::Checked<T, OverflowHandler> WTF::Checked<T, OverflowHandler>::operator*=(U) [with U = long unsigned int; T = long unsigned int; OverflowHandler = WTF::RecordOverflow]':
/home/alnone/.cache/yay/qt5-webkit/src/qtwebkit-5.212.0-alpha4/Source/WTF/wtf/FastMalloc.cpp:247:20:   required from here
/home/alnone/.cache/yay/qt5-webkit/src/qtwebkit-5.212.0-alpha4/Source/WTF/wtf/CheckedArithmetic.h:597:17: warning: implicitly-declared 'constexpr WTF::Checked<long unsigned int, WTF::RecordOverflow>::Checked(const WTF::Checked<long unsigned int, WTF::RecordOverflow>&)' is deprecated [-Wdeprecated-copy]
  597 |         return *this;
      |                 ^~~~
/home/alnone/.cache/yay/qt5-webkit/src/qtwebkit-5.212.0-alpha4/Source/WTF/wtf/CheckedArithmetic.h:496:20: note: because 'WTF::Checked<long unsigned int, WTF::RecordOverflow>' has user-provided 'const WTF::Checked<T, OverflowHandler>& WTF::Checked<T, OverflowHandler>::operator=(WTF::Checked<T, OverflowHandler>) [with T = long unsigned int; OverflowHandler = WTF::RecordOverflow]'
  496 |     const Checked& operator=(Checked rhs)
      |                    ^~~~~~~~
[  2%] Building CXX object Source/WTF/wtf/CMakeFiles/WTF.dir/FilePrintStream.cpp.o
[  2%] Building CXX object Source/WTF/wtf/CMakeFiles/WTF.dir/FunctionDispatcher.cpp.o
[  2%] Building CXX object Source/WTF/wtf/CMakeFiles/WTF.dir/GregorianDateTime.cpp.o
[  2%] Building CXX object Source/WTF/wtf/CMakeFiles/WTF.dir/HashTable.cpp.o
[  2%] Building CXX object Source/WTF/wtf/CMakeFiles/WTF.dir/Lock.cpp.o
[  2%] Building CXX object Source/WTF/wtf/CMakeFiles/WTF.dir/MD5.cpp.o
[  2%] Building CXX object Source/WTF/wtf/CMakeFiles/WTF.dir/MainThread.cpp.o
[  2%] Building CXX object Source/WTF/wtf/CMakeFiles/WTF.dir/MediaTime.cpp.o
[  2%] Building CXX object Source/WTF/wtf/CMakeFiles/WTF.dir/MetaAllocator.cpp.o
[  2%] Building CXX object Source/WTF/wtf/CMakeFiles/WTF.dir/NumberOfCores.cpp.o
[  2%] Building CXX object Source/WTF/wtf/CMakeFiles/WTF.dir/OSRandomSource.cpp.o
[  2%] Building CXX object Source/WTF/wtf/CMakeFiles/WTF.dir/PageBlock.cpp.o
[  2%] Building CXX object Source/WTF/wtf/CMakeFiles/WTF.dir/ParallelHelperPool.cpp.o
[  2%] Building CXX object Source/WTF/wtf/CMakeFiles/WTF.dir/ParallelJobsGeneric.cpp.o
[  2%] Building CXX object Source/WTF/wtf/CMakeFiles/WTF.dir/ParkingLot.cpp.o
[  2%] Building CXX object Source/WTF/wtf/CMakeFiles/WTF.dir/PrintStream.cpp.o
[  2%] Building CXX object Source/WTF/wtf/CMakeFiles/WTF.dir/RAMSize.cpp.o
[  2%] Building CXX object Source/WTF/wtf/CMakeFiles/WTF.dir/RandomNumber.cpp.o
[  2%] Building CXX object Source/WTF/wtf/CMakeFiles/WTF.dir/RefCountedLeakCounter.cpp.o
[  2%] Building CXX object Source/WTF/wtf/CMakeFiles/WTF.dir/RefCounter.cpp.o
[  2%] Building CXX object Source/WTF/wtf/CMakeFiles/WTF.dir/RunLoop.cpp.o
[  2%] Building CXX object Source/WTF/wtf/CMakeFiles/WTF.dir/SHA1.cpp.o
[  2%] Building CXX object Source/WTF/wtf/CMakeFiles/WTF.dir/SixCharacterHash.cpp.o
[  2%] Building CXX object Source/WTF/wtf/CMakeFiles/WTF.dir/StackBounds.cpp.o
[  2%] Building CXX object Source/WTF/wtf/CMakeFiles/WTF.dir/StackStats.cpp.o
[  2%] Building CXX object Source/WTF/wtf/CMakeFiles/WTF.dir/StringPrintStream.cpp.o
[  2%] Building CXX object Source/WTF/wtf/CMakeFiles/WTF.dir/Threading.cpp.o
[  2%] Building CXX object Source/WTF/wtf/CMakeFiles/WTF.dir/WTFThreadData.cpp.o
[  2%] Building CXX object Source/WTF/wtf/CMakeFiles/WTF.dir/WordLock.cpp.o
[  2%] Building CXX object Source/WTF/wtf/CMakeFiles/WTF.dir/WorkQueue.cpp.o
[  2%] Building CXX object Source/WTF/wtf/CMakeFiles/WTF.dir/dtoa.cpp.o
[  3%] Building CXX object Source/WTF/wtf/CMakeFiles/WTF.dir/dtoa/bignum-dtoa.cc.o
[  3%] Building CXX object Source/WTF/wtf/CMakeFiles/WTF.dir/dtoa/bignum.cc.o
[  3%] Building CXX object Source/WTF/wtf/CMakeFiles/WTF.dir/dtoa/cached-powers.cc.o
[  3%] Building CXX object Source/WTF/wtf/CMakeFiles/WTF.dir/dtoa/diy-fp.cc.o
[  3%] Building CXX object Source/WTF/wtf/CMakeFiles/WTF.dir/dtoa/double-conversion.cc.o
[  3%] Building CXX object Source/WTF/wtf/CMakeFiles/WTF.dir/dtoa/fast-dtoa.cc.o
[  3%] Building CXX object Source/WTF/wtf/CMakeFiles/WTF.dir/dtoa/fixed-dtoa.cc.o
[  3%] Building CXX object Source/WTF/wtf/CMakeFiles/WTF.dir/dtoa/strtod.cc.o
[  3%] Building CXX object Source/WTF/wtf/CMakeFiles/WTF.dir/text/AtomicString.cpp.o
[  3%] Building CXX object Source/WTF/wtf/CMakeFiles/WTF.dir/text/AtomicStringImpl.cpp.o
[  3%] Building CXX object Source/WTF/wtf/CMakeFiles/WTF.dir/text/AtomicStringTable.cpp.o
[  3%] Building CXX object Source/WTF/wtf/CMakeFiles/WTF.dir/text/Base64.cpp.o
[  3%] Building CXX object Source/WTF/wtf/CMakeFiles/WTF.dir/text/CString.cpp.o
[  3%] Building CXX object Source/WTF/wtf/CMakeFiles/WTF.dir/text/StringBuilder.cpp.o
[  3%] Building CXX object Source/WTF/wtf/CMakeFiles/WTF.dir/text/StringImpl.cpp.o
In file included from /home/alnone/.cache/yay/qt5-webkit/src/qtwebkit-5.212.0-alpha4/Source/WTF/wtf/StdLibExtras.h:33,
                 from /home/alnone/.cache/yay/qt5-webkit/src/qtwebkit-5.212.0-alpha4/Source/WTF/wtf/FastMalloc.h:26,
                 from /home/alnone/.cache/yay/qt5-webkit/src/qtwebkit-5.212.0-alpha4/Source/WTF/config.h:51,
                 from /home/alnone/.cache/yay/qt5-webkit/src/qtwebkit-5.212.0-alpha4/Source/WTF/wtf/text/StringImpl.cpp:25:
/home/alnone/.cache/yay/qt5-webkit/src/qtwebkit-5.212.0-alpha4/Source/WTF/wtf/CheckedArithmetic.h: In instantiation of 'WTF::Checked<typename WTF::Result<U, V>::ResultType, OverflowHandler> WTF::operator*(Checked<U, OverflowHandler>, V) [with U = long unsigned int; V = long unsigned int; OverflowHandler = CrashOnOverflow; typename Result<U, V>::ResultType = long unsigned int]':
/home/alnone/.cache/yay/qt5-webkit/src/qtwebkit-5.212.0-alpha4/Source/WTF/wtf/text/StringBuffer.h:44:90:   required from 'WTF::StringBuffer<T>::StringBuffer(unsigned int) [with CharType = unsigned char]'
/home/alnone/.cache/yay/qt5-webkit/src/qtwebkit-5.212.0-alpha4/Source/WTF/wtf/text/StringImpl.cpp:817:28:   required from 'WTF::Ref<WTF::StringImpl> WTF::StringImpl::removeCharacters(const CharType*, WTF::CharacterMatchFunctionPtr) [with CharType = unsigned char; WTF::CharacterMatchFunctionPtr = bool (*)(char16_t)]'
/home/alnone/.cache/yay/qt5-webkit/src/qtwebkit-5.212.0-alpha4/Source/WTF/wtf/text/StringImpl.cpp:841:32:   required from here
/home/alnone/.cache/yay/qt5-webkit/src/qtwebkit-5.212.0-alpha4/Source/WTF/wtf/CheckedArithmetic.h:761:16: warning: implicitly-declared 'constexpr WTF::Checked<long unsigned int>::Checked(const WTF::Checked<long unsigned int>&)' is deprecated [-Wdeprecated-copy]
  761 |     return lhs * Checked<V, OverflowHandler>(rhs);
      |            ~~~~^~~~~~~~~~~~~~~~~~~~~~~~~~~~~~~~~~
/home/alnone/.cache/yay/qt5-webkit/src/qtwebkit-5.212.0-alpha4/Source/WTF/wtf/CheckedArithmetic.h:496:20: note: because 'WTF::Checked<long unsigned int>' has user-provided 'const WTF::Checked<T, OverflowHandler>& WTF::Checked<T, OverflowHandler>::operator=(WTF::Checked<T, OverflowHandler>) [with T = long unsigned int; OverflowHandler = WTF::CrashOnOverflow]'
  496 |     const Checked& operator=(Checked rhs)
      |                    ^~~~~~~~
/home/alnone/.cache/yay/qt5-webkit/src/qtwebkit-5.212.0-alpha4/Source/WTF/wtf/CheckedArithmetic.h:737:173: note:   initializing argument 1 of 'WTF::Checked<typename WTF::Result<U, V>::ResultType, OverflowHandler> WTF::operator*(Checked<U, OverflowHandler>, Checked<V, OverflowHandler>) [with U = long unsigned int; V = long unsigned int; OverflowHandler = CrashOnOverflow; typename Result<U, V>::ResultType = long unsigned int]'
  737 | tType, OverflowHandler> operator*(Checked<U, OverflowHandler> lhs, Checked<V, OverflowHandler> rhs)
      |                                   ~~~~~~~~~~~~~~~~~~~~~~~~~~~~^~~

[  3%] Building CXX object Source/WTF/wtf/CMakeFiles/WTF.dir/text/StringStatics.cpp.o
[  3%] Building CXX object Source/WTF/wtf/CMakeFiles/WTF.dir/text/StringView.cpp.o
[  3%] Building CXX object Source/WTF/wtf/CMakeFiles/WTF.dir/text/SymbolRegistry.cpp.o
[  3%] Building CXX object Source/WTF/wtf/CMakeFiles/WTF.dir/text/WTFString.cpp.o
[  3%] Building CXX object Source/WTF/wtf/CMakeFiles/WTF.dir/threads/BinarySemaphore.cpp.o
[  3%] Building CXX object Source/WTF/wtf/CMakeFiles/WTF.dir/unicode/UTF8.cpp.o
[  3%] Building CXX object Source/WTF/wtf/CMakeFiles/WTF.dir/unicode/icu/CollatorICU.cpp.o
[  3%] Building CXX object Source/WTF/wtf/CMakeFiles/WTF.dir/OSAllocatorPosix.cpp.o
[  3%] Building CXX object Source/WTF/wtf/CMakeFiles/WTF.dir/ThreadIdentifierDataPthreads.cpp.o
[  3%] Building CXX object Source/WTF/wtf/CMakeFiles/WTF.dir/ThreadingPthreads.cpp.o
[  3%] Building CXX object Source/WTF/wtf/CMakeFiles/WTF.dir/qt/MainThreadQt.cpp.o
[  3%] Building CXX object Source/WTF/wtf/CMakeFiles/WTF.dir/qt/RunLoopQt.cpp.o
[  3%] Building CXX object Source/WTF/wtf/CMakeFiles/WTF.dir/text/qt/StringQt.cpp.o
[  3%] Building CXX object Source/WTF/wtf/CMakeFiles/WTF.dir/UniStdExtras.cpp.o
[  3%] Building CXX object Source/WTF/wtf/CMakeFiles/WTF.dir/qt/WorkQueueQt.cpp.o
[  3%] Building CXX object Source/WTF/wtf/CMakeFiles/WTF.dir/glib/GRefPtr.cpp.o
[  3%] Linking CXX static library ../../../lib/libWTF.a
[  3%] Built target WTF
[  3%] Generating ../../DerivedSources/JavaScriptCore/Bytecodes.h, ../../DerivedSources/JavaScriptCore/InitBytecodes.asm
[  3%] Generating ../../DerivedSources/JavaScriptCore/LLIntDesiredOffsets.h
[  3%] Building CXX object Source/JavaScriptCore/CMakeFiles/LLIntOffsetsExtractor.dir/llint/LLIntOffsetsExtractor.cpp.o
[  3%] Linking CXX executable ../../bin/LLIntOffsetsExtractor
/usr/bin/ld.gold: pack-relative-relocs: unknown -z option
/usr/bin/ld.gold: use the --help option for usage information
collect2: error: ld returned 1 exit status
make[2]: *** [Source/JavaScriptCore/CMakeFiles/LLIntOffsetsExtractor.dir/build.make:139: bin/LLIntOffsetsExtractor] Error 1
make[1]: *** [CMakeFiles/Makefile2:1527: Source/JavaScriptCore/CMakeFiles/LLIntOffsetsExtractor.dir/all] Error 2
make: *** [Makefile:166: all] Error 2
==> ERROR: A failure occurred in build().
    Aborting...
 -> Failed to install layer, rolling up to next layer.error:error making: qt5-webkit - exit status 4
==> Making package: qt5-webkit 5.212.0alpha4-22 (Wed 20 Mar 2024 11:26:33 AM EDT)
==> Checking runtime dependencies...
==> Checking buildtime dependencies...
==> Retrieving sources...
  -> Found qtwebkit-5.212.0-alpha4.tar.xz
  -> Found qtwebkit-cstdint.patch
  -> Found icu68.patch
  -> Found glib-2.68.patch
  -> Found qt5-webkit-python-3.9.patch
  -> Found qt5-webkit-bison-3.7.patch
==> Validating source files with sha256sums...
    qtwebkit-5.212.0-alpha4.tar.xz ... Passed
    qtwebkit-cstdint.patch ... Passed
    icu68.patch ... Passed
    glib-2.68.patch ... Passed
    qt5-webkit-python-3.9.patch ... Passed
    qt5-webkit-bison-3.7.patch ... Passed
==> Removing existing $srcdir/ directory...
==> Extracting sources...
  -> Extracting qtwebkit-5.212.0-alpha4.tar.xz with bsdtar
==> Starting prepare()...
patching file Source/WebCore/platform/text/TextCodecICU.cpp
patching file Source/WebCore/platform/text/icu/UTextProvider.h
patching file Source/WebCore/platform/text/icu/UTextProviderLatin1.cpp
patching file Source/WebCore/platform/text/icu/UTextProviderUTF16.cpp
patching file Source/WTF/wtf/glib/GRefPtr.h
Hunk #1 succeeded at 29 with fuzz 2.
patching file Source/JavaScriptCore/generate-bytecode-files
patching file Source/WebCore/css/makegrammar.pl
patching file Source/ThirdParty/ANGLE/src/common/mathutil.h
==> Sources are ready.
==> Making package: qt5-webkit 5.212.0alpha4-22 (Wed 20 Mar 2024 11:26:36 AM EDT)
==> Checking runtime dependencies...
==> Checking buildtime dependencies...
==> WARNING: Using existing $srcdir/ tree
==> Removing existing $pkgdir/ directory...
==> Starting build()...
-- The C compiler identification is GNU 13.2.1
-- The CXX compiler identification is GNU 13.2.1
-- Detecting C compiler ABI info
-- Detecting C compiler ABI info - done
-- Check for working C compiler: /usr/bin/cc - skipped
-- Detecting C compile features
-- Detecting C compile features - done
-- Detecting CXX compiler ABI info
-- Detecting CXX compiler ABI info - done
-- Check for working CXX compiler: /usr/bin/c++ - skipped
-- Detecting CXX compile features
-- Detecting CXX compile features - done
-- Found BISON: /usr/bin/bison (found suitable version "3.8.2", minimum required is "2.1") 
-- Found Gperf: /usr/bin/gperf (Required is at least version "3.0.1") 
-- Found Perl: /usr/bin/perl (found suitable version "5.38.2", minimum required is "5.10.0") 
-- Found PythonInterp: /usr/bin/python3 (found suitable version "3.11.8", minimum required is "2.7.0") 
-- Found Ruby: /usr/bin/ruby (found suitable version "3.0.6", minimum required is "1.9") 
-- Looking for include file features.h
-- Looking for include file features.h - found
-- Found PkgConfig: /usr/bin/pkg-config (found version "2.1.1") 
-- Checking for module 'sqlite3'
--   Found sqlite3, version 3.45.2
-- Found Sqlite: /usr/include  
-- Performing Test CMAKE_HAVE_LIBC_PTHREAD
-- Performing Test CMAKE_HAVE_LIBC_PTHREAD - Success
-- Found Threads: TRUE  
-- Found JPEG: /usr/lib/libjpeg.so (found version "80") 
-- Found ZLIB: /usr/lib/libz.so (found version "1.3.1")  
-- Found PNG: /usr/lib/libpng.so (found version "1.6.43") 
-- Checking for module 'icu-uc'
--   Found icu-uc, version 74.2
-- Checking for module 'icu-i18n'
--   Found icu-i18n, version 74.2
-- Found ICU header files in /usr/include
-- Found ICU libraries: /usr/lib/libicuuc.so
-- Found LibXml2: /usr/lib/libxml2.so (found suitable version "2.12.6", minimum required is "2.8.0") 
-- Could NOT find Dwz (missing: DWZ_EXECUTABLE) (Required is at least version "0.13")
-- Found WebP: /usr/include  
-- Qt OpenGL implementation: GL
-- Qt OpenGL libraries: Qt5::Gui_GL
-- Qt EGL libraries: Qt5::Gui_EGL
-- Performing Test Qt5Gui_PRIVATE_HEADER_FOUND
-- Performing Test Qt5Gui_PRIVATE_HEADER_FOUND - Success
-- Performing Test Qt5Network_PRIVATE_HEADER_FOUND
-- Performing Test Qt5Network_PRIVATE_HEADER_FOUND - Success
-- Performing Test Qt5Quick_PRIVATE_HEADER_FOUND
-- Performing Test Qt5Quick_PRIVATE_HEADER_FOUND - Success
-- Found X11: /usr/include   
-- Looking for XOpenDisplay in /usr/lib/libX11.so;/usr/lib/libXext.so
-- Looking for XOpenDisplay in /usr/lib/libX11.so;/usr/lib/libXext.so - found
-- Looking for gethostbyname
-- Looking for gethostbyname - found
-- Looking for connect
-- Looking for connect - found
-- Looking for remove
-- Looking for remove - found
-- Looking for shmat
-- Looking for shmat - found
-- Looking for IceConnectionNumber in ICE
-- Looking for IceConnectionNumber in ICE - found
-- Found GLIB: /usr/include/glib-2.0;/usr/lib/glib-2.0/include (found suitable version "2.78.4", minimum required is "2.36") 
-- Checking for module 'gstreamer-1.0 >= 1.0.3'
--   Found gstreamer-1.0, version 1.24.0
-- Checking for module 'gstreamer-base-1.0 >= 1.0.3'
--   Found gstreamer-base-1.0, version 1.24.0
-- Checking for module 'gstreamer-app-1.0 >= 1.0.3'
--   Found gstreamer-app-1.0, version 1.24.0
-- Checking for module 'gstreamer-audio-1.0 >= 1.0.3'
--   Found gstreamer-audio-1.0, version 1.24.0
-- Checking for module 'gstreamer-fft-1.0 >= 1.0.3'
--   Found gstreamer-fft-1.0, version 1.24.0
-- Checking for module 'gstreamer-gl-1.0>=1.6.0'
--   Found gstreamer-gl-1.0, version 1.24.0
-- Checking for module 'gstreamer-mpegts-1.0>=1.4.0'
--   Found gstreamer-mpegts-1.0, version 1.24.0
-- Checking for module 'gstreamer-pbutils-1.0 >= 1.0.3'
--   Found gstreamer-pbutils-1.0, version 1.24.0
-- Checking for module 'gstreamer-tag-1.0 >= 1.0.3'
--   Found gstreamer-tag-1.0, version 1.24.0
-- Checking for module 'gstreamer-video-1.0 >= 1.0.3'
--   Found gstreamer-video-1.0, version 1.24.0
-- Found GStreamer: GSTREAMER_INCLUDE_DIRS;GSTREAMER_LIBRARIES;GSTREAMER_VERSION;GSTREAMER_BASE_INCLUDE_DIRS;GSTREAMER_BASE_LIBRARIES;GSTREAMER_APP_INCLUDE_DIRS;GSTREAMER_APP_LIBRARIES;GSTREAMER_PBUTILS_INCLUDE_DIRS;GSTREAMER_PBUTILS_LIBRARIES;GSTREAMER_VIDEO_INCLUDE_DIRS;GSTREAMER_VIDEO_LIBRARIES;GSTREAMER_MPEGTS_INCLUDE_DIRS;GSTREAMER_MPEGTS_LIBRARIES;GSTREAMER_TAG_INCLUDE_DIRS;GSTREAMER_TAG_LIBRARIES;GSTREAMER_GL_INCLUDE_DIRS;GSTREAMER_GL_LIBRARIES;GSTREAMER_AUDIO_INCLUDE_DIRS;GSTREAMER_AUDIO_LIBRARIES;GSTREAMER_FFT_INCLUDE_DIRS;GSTREAMER_FFT_LIBRARIES (Required is at least version "1.0.3") 
-- Found Hyphen: /usr/include  
-- Checking for module 'libwoff2dec'
--   Found libwoff2dec, version 1.0.2
-- Found WOFF2Dec: /usr/include (found suitable version "1.0.2", minimum required is "1.0.1") 
-- Using system WOFF2Dec library.
-- The following OPTIONAL packages have been found:

 * JPEG
 * WebP
 * Qt5OpenGL (required version >= 5.2.0)
 * PkgConfig
 * WOFF2Dec (required version >= 1.0.1)

-- The following REQUIRED packages have been found:

 * BISON (required version >= 2.1)
 * Gperf (required version >= 3.0.1)
 * Perl (required version >= 5.10.0)
 * PythonInterp (required version >= 2.7.0)
 * Ruby (required version >= 1.9)
 * Sqlite
 * Threads
 * PNG
 * ZLIB
 * ICU
 * LibXml2 (required version >= 2.8.0)
 * Qt5Core
 * Qt5Gui
 * Qt5Network
 * Qt5Widgets
 * Qt5Test
 * Qt5QuickTest
 * Qt5Positioning
 * Qt5Sensors
 * Qt5PrintSupport
   Required for ENABLE_PRINT_SUPPORT=ON
 * Qt5Qml (required version >= 5.15.13)
 * Qt5QmlModels (required version >= 5.15.13)
 * Qt5Quick
 * Qt5WebChannel
 * Qt5 (required version >= 5.2.0)
 * X11
 * GLIB (required version >= 2.36)
 * GStreamer (required version >= 1.0.3)
 * Hyphen

-- The following OPTIONAL packages have not been found:

 * Dwz (required version >= 0.13)

-- Installing in the same prefix as Qt, adopting their path scheme.
-- Using platform-specific CMakeLists: /home/alnone/.cache/yay/qt5-webkit/src/qtwebkit-5.212.0-alpha4/Source/WTF/wtf/PlatformQt.cmake
-- Looking for clock_gettime
-- Looking for clock_gettime - found
-- Using platform-specific CMakeLists: /home/alnone/.cache/yay/qt5-webkit/src/qtwebkit-5.212.0-alpha4/Source/JavaScriptCore/PlatformQt.cmake
-- Using platform-specific CMakeLists: /home/alnone/.cache/yay/qt5-webkit/src/qtwebkit-5.212.0-alpha4/Source/JavaScriptCore/shell/PlatformQt.cmake
-- All-in-One build is enabled.
-- Using platform-specific CMakeLists: /home/alnone/.cache/yay/qt5-webkit/src/qtwebkit-5.212.0-alpha4/Source/WebCore/PlatformQt.cmake
-- Using platform-specific CMakeLists: /home/alnone/.cache/yay/qt5-webkit/src/qtwebkit-5.212.0-alpha4/Source/WebKit/PlatformQt.cmake
-- Performing Test ATOMIC_INT64_IS_BUILTIN
-- Performing Test ATOMIC_INT64_IS_BUILTIN - Success
-- Looking for shm_open
-- Looking for shm_open - found
-- Using platform-specific CMakeLists: /home/alnone/.cache/yay/qt5-webkit/src/qtwebkit-5.212.0-alpha4/Source/WebKit2/PlatformQt.cmake
-- Using platform-specific CMakeLists: /home/alnone/.cache/yay/qt5-webkit/src/qtwebkit-5.212.0-alpha4/Source/PlatformQt.cmake
-- Enabled features:
--  ENABLE_ACCELERATED_2D_CANVAS ............ ON
--  ENABLE_ALLINONE_BUILD                     ON
--  ENABLE_API_TESTS ........................ ON
--  ENABLE_CSS_GRID_LAYOUT                    ON
--  ENABLE_DATABASE_PROCESS ................. ON
--  ENABLE_DATALIST_ELEMENT                   ON
--  ENABLE_DEVICE_ORIENTATION ............... ON
--  ENABLE_DRAG_SUPPORT                       ON
--  ENABLE_FULLSCREEN_API ................... ON
--  ENABLE_GAMEPAD_DEPRECATED                 ON
--  ENABLE_GEOLOCATION ...................... ON
--  ENABLE_ICONDATABASE                       ON
--  ENABLE_INDEXED_DATABASE ................. ON
--  ENABLE_INSPECTOR_UI                       ON
--  ENABLE_JIT .............................. ON
--  ENABLE_LEGACY_WEB_AUDIO                   ON
--  ENABLE_LINK_PREFETCH .................... ON
--  ENABLE_MEDIA_SOURCE                       ON
--  ENABLE_NETSCAPE_PLUGIN_API .............. ON
--  ENABLE_OPENGL                             ON
--  ENABLE_PRINT_SUPPORT .................... ON
--  ENABLE_QT_GESTURE_EVENTS                  ON
--  ENABLE_QT_WEBCHANNEL .................... ON
--  ENABLE_SAMPLING_PROFILER                  ON
--  ENABLE_SPELLCHECK ....................... ON
--  ENABLE_TOUCH_EVENTS                       ON
--  ENABLE_VIDEO ............................ ON
--  ENABLE_WEBKIT2                            ON
--  ENABLE_WEB_AUDIO ........................ ON
--  ENABLE_X11_TARGET                         ON
--  ENABLE_XSLT ............................. OFF
--  USE_GSTREAMER                             ON
--  USE_LIBHYPHEN ........................... ON
--  USE_LIBJPEG                               ON
--  USE_MEDIA_FOUNDATION .................... OFF
--  USE_QT_MULTIMEDIA                         OFF
--  USE_SYSTEM_MALLOC ....................... OFF
--  USE_WOFF2                                 ON
-- Configuring done (10.4s)
-- Generating done (0.6s)
-- Build files have been written to: /home/alnone/.cache/yay/qt5-webkit/src/build
[  0%] Built target WebKit2-forwarding-headers
[  0%] Generating ../../DerivedSources/ForwardingHeaders/JavaScriptCore/Scripts/UpdateContents.py
[  0%] Generating ../../DerivedSources/ForwardingHeaders/JavaScriptCore/Scripts/builtins_generate_combined_header.py
[  0%] Generating ../../DerivedSources/ForwardingHeaders/JavaScriptCore/Scripts/builtins_generate_combined_implementation.py
[  0%] Generating ../../DerivedSources/ForwardingHeaders/JavaScriptCore/Scripts/builtins_generate_separate_header.py
[  0%] Generating ../../DerivedSources/ForwardingHeaders/JavaScriptCore/Scripts/builtins_generate_separate_implementation.py
[  0%] Generating ../../DerivedSources/ForwardingHeaders/JavaScriptCore/Scripts/builtins_generator.py
[  0%] Generating ../../DerivedSources/ForwardingHeaders/JavaScriptCore/Scripts/builtins_model.py
[  0%] Generating ../../DerivedSources/ForwardingHeaders/JavaScriptCore/Scripts/builtins_templates.py
[  0%] Generating ../../DerivedSources/ForwardingHeaders/JavaScriptCore/Scripts/cssmin.py
[  0%] Generating ../../DerivedSources/ForwardingHeaders/JavaScriptCore/Scripts/generate-combined-inspector-json.py
[  0%] Generating ../../DerivedSources/ForwardingHeaders/JavaScriptCore/Scripts/generate-js-builtins.py
[  0%] Generating ../../DerivedSources/ForwardingHeaders/JavaScriptCore/Scripts/inline-and-minify-stylesheets-and-scripts.py
[  0%] Generating ../../DerivedSources/ForwardingHeaders/JavaScriptCore/Scripts/jsmin.py
[  0%] Generating ../../DerivedSources/ForwardingHeaders/JavaScriptCore/Scripts/lazywriter.py
[  0%] Generating ../../DerivedSources/ForwardingHeaders/JavaScriptCore/Scripts/make-js-file-arrays.py
[  0%] Generating ../../DerivedSources/ForwardingHeaders/JavaScriptCore/Scripts/wkbuiltins.py
[  0%] Generating ../../DerivedSources/ForwardingHeaders/JavaScriptCore/Scripts/xxd.pl
[  0%] Built target stageSharedScripts
[  0%] Building CXX object Source/bmalloc/CMakeFiles/bmalloc.dir/bmalloc/Allocator.cpp.o
[  0%] Building CXX object Source/bmalloc/CMakeFiles/bmalloc.dir/bmalloc/Cache.cpp.o
[  0%] Building CXX object Source/bmalloc/CMakeFiles/bmalloc.dir/bmalloc/Deallocator.cpp.o
[  0%] Building CXX object Source/bmalloc/CMakeFiles/bmalloc.dir/bmalloc/Environment.cpp.o
[  0%] Building CXX object Source/bmalloc/CMakeFiles/bmalloc.dir/bmalloc/Heap.cpp.o
[  0%] Building CXX object Source/bmalloc/CMakeFiles/bmalloc.dir/bmalloc/Logging.cpp.o
[  0%] Building CXX object Source/bmalloc/CMakeFiles/bmalloc.dir/bmalloc/ObjectType.cpp.o
[  0%] Building CXX object Source/bmalloc/CMakeFiles/bmalloc.dir/bmalloc/StaticMutex.cpp.o
[  0%] Building CXX object Source/bmalloc/CMakeFiles/bmalloc.dir/bmalloc/VMHeap.cpp.o
[  0%] Building CXX object Source/bmalloc/CMakeFiles/bmalloc.dir/bmalloc/XLargeMap.cpp.o
[  0%] Building CXX object Source/bmalloc/CMakeFiles/bmalloc.dir/bmalloc/mbmalloc.cpp.o
[  1%] Linking CXX static library ../../lib/libbmalloc.a
[  1%] Built target bmalloc
[  2%] Generating WorkQueueQt.moc
[  2%] Generating MainThreadQt.moc
[  2%] Generating RunLoopQt.moc
[  2%] Building CXX object Source/WTF/wtf/CMakeFiles/WTF.dir/Assertions.cpp.o
[  2%] Building CXX object Source/WTF/wtf/CMakeFiles/WTF.dir/Atomics.cpp.o
[  2%] Building CXX object Source/WTF/wtf/CMakeFiles/WTF.dir/BitVector.cpp.o
[  2%] Building CXX object Source/WTF/wtf/CMakeFiles/WTF.dir/CompilationThread.cpp.o
[  2%] Building CXX object Source/WTF/wtf/CMakeFiles/WTF.dir/CryptographicUtilities.cpp.o
[  2%] Building CXX object Source/WTF/wtf/CMakeFiles/WTF.dir/CryptographicallyRandomNumber.cpp.o
[  2%] Building CXX object Source/WTF/wtf/CMakeFiles/WTF.dir/CurrentTime.cpp.o
[  2%] Building CXX object Source/WTF/wtf/CMakeFiles/WTF.dir/DataLog.cpp.o
[  2%] Building CXX object Source/WTF/wtf/CMakeFiles/WTF.dir/DateMath.cpp.o
[  2%] Building CXX object Source/WTF/wtf/CMakeFiles/WTF.dir/DecimalNumber.cpp.o
[  2%] Building CXX object Source/WTF/wtf/CMakeFiles/WTF.dir/FastBitVector.cpp.o
[  2%] Building CXX object Source/WTF/wtf/CMakeFiles/WTF.dir/FastMalloc.cpp.o
In file included from /home/alnone/.cache/yay/qt5-webkit/src/qtwebkit-5.212.0-alpha4/Source/WTF/wtf/StdLibExtras.h:33,
                 from /home/alnone/.cache/yay/qt5-webkit/src/qtwebkit-5.212.0-alpha4/Source/WTF/wtf/FastMalloc.h:26,
                 from /home/alnone/.cache/yay/qt5-webkit/src/qtwebkit-5.212.0-alpha4/Source/WTF/config.h:51,
                 from /home/alnone/.cache/yay/qt5-webkit/src/qtwebkit-5.212.0-alpha4/Source/WTF/wtf/FastMalloc.cpp:27:
/home/alnone/.cache/yay/qt5-webkit/src/qtwebkit-5.212.0-alpha4/Source/WTF/wtf/CheckedArithmetic.h: In instantiation of 'const WTF::Checked<T, OverflowHandler> WTF::Checked<T, OverflowHandler>::operator*=(U) [with U = long unsigned int; T = long unsigned int; OverflowHandler = WTF::CrashOnOverflow]':
/home/alnone/.cache/yay/qt5-webkit/src/qtwebkit-5.212.0-alpha4/Source/WTF/wtf/FastMalloc.cpp:199:20:   required from here
/home/alnone/.cache/yay/qt5-webkit/src/qtwebkit-5.212.0-alpha4/Source/WTF/wtf/CheckedArithmetic.h:597:17: warning: implicitly-declared 'constexpr WTF::Checked<long unsigned int>::Checked(const WTF::Checked<long unsigned int>&)' is deprecated [-Wdeprecated-copy]
  597 |         return *this;
      |                 ^~~~
/home/alnone/.cache/yay/qt5-webkit/src/qtwebkit-5.212.0-alpha4/Source/WTF/wtf/CheckedArithmetic.h:496:20: note: because 'WTF::Checked<long unsigned int>' has user-provided 'const WTF::Checked<T, OverflowHandler>& WTF::Checked<T, OverflowHandler>::operator=(WTF::Checked<T, OverflowHandler>) [with T = long unsigned int; OverflowHandler = WTF::CrashOnOverflow]'
  496 |     const Checked& operator=(Checked rhs)
      |                    ^~~~~~~~
/home/alnone/.cache/yay/qt5-webkit/src/qtwebkit-5.212.0-alpha4/Source/WTF/wtf/CheckedArithmetic.h: In instantiation of 'const WTF::Checked<T, OverflowHandler> WTF::Checked<T, OverflowHandler>::operator*=(U) [with U = long unsigned int; T = long unsigned int; OverflowHandler = WTF::RecordOverflow]':
/home/alnone/.cache/yay/qt5-webkit/src/qtwebkit-5.212.0-alpha4/Source/WTF/wtf/FastMalloc.cpp:247:20:   required from here
/home/alnone/.cache/yay/qt5-webkit/src/qtwebkit-5.212.0-alpha4/Source/WTF/wtf/CheckedArithmetic.h:597:17: warning: implicitly-declared 'constexpr WTF::Checked<long unsigned int, WTF::RecordOverflow>::Checked(const WTF::Checked<long unsigned int, WTF::RecordOverflow>&)' is deprecated [-Wdeprecated-copy]
  597 |         return *this;
      |                 ^~~~
/home/alnone/.cache/yay/qt5-webkit/src/qtwebkit-5.212.0-alpha4/Source/WTF/wtf/CheckedArithmetic.h:496:20: note: because 'WTF::Checked<long unsigned int, WTF::RecordOverflow>' has user-provided 'const WTF::Checked<T, OverflowHandler>& WTF::Checked<T, OverflowHandler>::operator=(WTF::Checked<T, OverflowHandler>) [with T = long unsigned int; OverflowHandler = WTF::RecordOverflow]'
  496 |     const Checked& operator=(Checked rhs)
      |                    ^~~~~~~~
[  2%] Building CXX object Source/WTF/wtf/CMakeFiles/WTF.dir/FilePrintStream.cpp.o
[  2%] Building CXX object Source/WTF/wtf/CMakeFiles/WTF.dir/FunctionDispatcher.cpp.o
[  2%] Building CXX object Source/WTF/wtf/CMakeFiles/WTF.dir/GregorianDateTime.cpp.o
[  2%] Building CXX object Source/WTF/wtf/CMakeFiles/WTF.dir/HashTable.cpp.o
[  2%] Building CXX object Source/WTF/wtf/CMakeFiles/WTF.dir/Lock.cpp.o
[  2%] Building CXX object Source/WTF/wtf/CMakeFiles/WTF.dir/MD5.cpp.o
[  2%] Building CXX object Source/WTF/wtf/CMakeFiles/WTF.dir/MainThread.cpp.o
[  2%] Building CXX object Source/WTF/wtf/CMakeFiles/WTF.dir/MediaTime.cpp.o
[  2%] Building CXX object Source/WTF/wtf/CMakeFiles/WTF.dir/MetaAllocator.cpp.o
[  2%] Building CXX object Source/WTF/wtf/CMakeFiles/WTF.dir/NumberOfCores.cpp.o
[  2%] Building CXX object Source/WTF/wtf/CMakeFiles/WTF.dir/OSRandomSource.cpp.o
[  2%] Building CXX object Source/WTF/wtf/CMakeFiles/WTF.dir/PageBlock.cpp.o
[  2%] Building CXX object Source/WTF/wtf/CMakeFiles/WTF.dir/ParallelHelperPool.cpp.o
[  2%] Building CXX object Source/WTF/wtf/CMakeFiles/WTF.dir/ParallelJobsGeneric.cpp.o
[  2%] Building CXX object Source/WTF/wtf/CMakeFiles/WTF.dir/ParkingLot.cpp.o
[  2%] Building CXX object Source/WTF/wtf/CMakeFiles/WTF.dir/PrintStream.cpp.o
[  2%] Building CXX object Source/WTF/wtf/CMakeFiles/WTF.dir/RAMSize.cpp.o
[  2%] Building CXX object Source/WTF/wtf/CMakeFiles/WTF.dir/RandomNumber.cpp.o
[  2%] Building CXX object Source/WTF/wtf/CMakeFiles/WTF.dir/RefCountedLeakCounter.cpp.o
[  2%] Building CXX object Source/WTF/wtf/CMakeFiles/WTF.dir/RefCounter.cpp.o
[  2%] Building CXX object Source/WTF/wtf/CMakeFiles/WTF.dir/RunLoop.cpp.o
[  2%] Building CXX object Source/WTF/wtf/CMakeFiles/WTF.dir/SHA1.cpp.o
[  2%] Building CXX object Source/WTF/wtf/CMakeFiles/WTF.dir/SixCharacterHash.cpp.o
[  2%] Building CXX object Source/WTF/wtf/CMakeFiles/WTF.dir/StackBounds.cpp.o
[  2%] Building CXX object Source/WTF/wtf/CMakeFiles/WTF.dir/StackStats.cpp.o
[  2%] Building CXX object Source/WTF/wtf/CMakeFiles/WTF.dir/StringPrintStream.cpp.o
[  2%] Building CXX object Source/WTF/wtf/CMakeFiles/WTF.dir/Threading.cpp.o
[  2%] Building CXX object Source/WTF/wtf/CMakeFiles/WTF.dir/WTFThreadData.cpp.o
[  2%] Building CXX object Source/WTF/wtf/CMakeFiles/WTF.dir/WordLock.cpp.o
[  2%] Building CXX object Source/WTF/wtf/CMakeFiles/WTF.dir/WorkQueue.cpp.o
[  2%] Building CXX object Source/WTF/wtf/CMakeFiles/WTF.dir/dtoa.cpp.o
[  3%] Building CXX object Source/WTF/wtf/CMakeFiles/WTF.dir/dtoa/bignum-dtoa.cc.o
[  3%] Building CXX object Source/WTF/wtf/CMakeFiles/WTF.dir/dtoa/bignum.cc.o
[  3%] Building CXX object Source/WTF/wtf/CMakeFiles/WTF.dir/dtoa/cached-powers.cc.o
[  3%] Building CXX object Source/WTF/wtf/CMakeFiles/WTF.dir/dtoa/diy-fp.cc.o
[  3%] Building CXX object Source/WTF/wtf/CMakeFiles/WTF.dir/dtoa/double-conversion.cc.o
[  3%] Building CXX object Source/WTF/wtf/CMakeFiles/WTF.dir/dtoa/fast-dtoa.cc.o
[  3%] Building CXX object Source/WTF/wtf/CMakeFiles/WTF.dir/dtoa/fixed-dtoa.cc.o
[  3%] Building CXX object Source/WTF/wtf/CMakeFiles/WTF.dir/dtoa/strtod.cc.o
[  3%] Building CXX object Source/WTF/wtf/CMakeFiles/WTF.dir/text/AtomicString.cpp.o
[  3%] Building CXX object Source/WTF/wtf/CMakeFiles/WTF.dir/text/AtomicStringImpl.cpp.o
[  3%] Building CXX object Source/WTF/wtf/CMakeFiles/WTF.dir/text/AtomicStringTable.cpp.o
[  3%] Building CXX object Source/WTF/wtf/CMakeFiles/WTF.dir/text/Base64.cpp.o
[  3%] Building CXX object Source/WTF/wtf/CMakeFiles/WTF.dir/text/CString.cpp.o
[  3%] Building CXX object Source/WTF/wtf/CMakeFiles/WTF.dir/text/StringBuilder.cpp.o
[  3%] Building CXX object Source/WTF/wtf/CMakeFiles/WTF.dir/text/StringImpl.cpp.o
In file included from /home/alnone/.cache/yay/qt5-webkit/src/qtwebkit-5.212.0-alpha4/Source/WTF/wtf/StdLibExtras.h:33,
                 from /home/alnone/.cache/yay/qt5-webkit/src/qtwebkit-5.212.0-alpha4/Source/WTF/wtf/FastMalloc.h:26,
                 from /home/alnone/.cache/yay/qt5-webkit/src/qtwebkit-5.212.0-alpha4/Source/WTF/config.h:51,
                 from /home/alnone/.cache/yay/qt5-webkit/src/qtwebkit-5.212.0-alpha4/Source/WTF/wtf/text/StringImpl.cpp:25:
/home/alnone/.cache/yay/qt5-webkit/src/qtwebkit-5.212.0-alpha4/Source/WTF/wtf/CheckedArithmetic.h: In instantiation of 'WTF::Checked<typename WTF::Result<U, V>::ResultType, OverflowHandler> WTF::operator*(Checked<U, OverflowHandler>, V) [with U = long unsigned int; V = long unsigned int; OverflowHandler = CrashOnOverflow; typename Result<U, V>::ResultType = long unsigned int]':
/home/alnone/.cache/yay/qt5-webkit/src/qtwebkit-5.212.0-alpha4/Source/WTF/wtf/text/StringBuffer.h:44:90:   required from 'WTF::StringBuffer<T>::StringBuffer(unsigned int) [with CharType = unsigned char]'
/home/alnone/.cache/yay/qt5-webkit/src/qtwebkit-5.212.0-alpha4/Source/WTF/wtf/text/StringImpl.cpp:817:28:   required from 'WTF::Ref<WTF::StringImpl> WTF::StringImpl::removeCharacters(const CharType*, WTF::CharacterMatchFunctionPtr) [with CharType = unsigned char; WTF::CharacterMatchFunctionPtr = bool (*)(char16_t)]'
/home/alnone/.cache/yay/qt5-webkit/src/qtwebkit-5.212.0-alpha4/Source/WTF/wtf/text/StringImpl.cpp:841:32:   required from here
/home/alnone/.cache/yay/qt5-webkit/src/qtwebkit-5.212.0-alpha4/Source/WTF/wtf/CheckedArithmetic.h:761:16: warning: implicitly-declared 'constexpr WTF::Checked<long unsigned int>::Checked(const WTF::Checked<long unsigned int>&)' is deprecated [-Wdeprecated-copy]
  761 |     return lhs * Checked<V, OverflowHandler>(rhs);
      |            ~~~~^~~~~~~~~~~~~~~~~~~~~~~~~~~~~~~~~~
/home/alnone/.cache/yay/qt5-webkit/src/qtwebkit-5.212.0-alpha4/Source/WTF/wtf/CheckedArithmetic.h:496:20: note: because 'WTF::Checked<long unsigned int>' has user-provided 'const WTF::Checked<T, OverflowHandler>& WTF::Checked<T, OverflowHandler>::operator=(WTF::Checked<T, OverflowHandler>) [with T = long unsigned int; OverflowHandler = WTF::CrashOnOverflow]'
  496 |     const Checked& operator=(Checked rhs)
      |                    ^~~~~~~~
/home/alnone/.cache/yay/qt5-webkit/src/qtwebkit-5.212.0-alpha4/Source/WTF/wtf/CheckedArithmetic.h:737:173: note:   initializing argument 1 of 'WTF::Checked<typename WTF::Result<U, V>::ResultType, OverflowHandler> WTF::operator*(Checked<U, OverflowHandler>, Checked<V, OverflowHandler>) [with U = long unsigned int; V = long unsigned int; OverflowHandler = CrashOnOverflow; typename Result<U, V>::ResultType = long unsigned int]'
  737 | tType, OverflowHandler> operator*(Checked<U, OverflowHandler> lhs, Checked<V, OverflowHandler> rhs)
      |                                   ~~~~~~~~~~~~~~~~~~~~~~~~~~~~^~~

[  3%] Building CXX object Source/WTF/wtf/CMakeFiles/WTF.dir/text/StringStatics.cpp.o
[  3%] Building CXX object Source/WTF/wtf/CMakeFiles/WTF.dir/text/StringView.cpp.o
[  3%] Building CXX object Source/WTF/wtf/CMakeFiles/WTF.dir/text/SymbolRegistry.cpp.o
[  3%] Building CXX object Source/WTF/wtf/CMakeFiles/WTF.dir/text/WTFString.cpp.o
[  3%] Building CXX object Source/WTF/wtf/CMakeFiles/WTF.dir/threads/BinarySemaphore.cpp.o
[  3%] Building CXX object Source/WTF/wtf/CMakeFiles/WTF.dir/unicode/UTF8.cpp.o
[  3%] Building CXX object Source/WTF/wtf/CMakeFiles/WTF.dir/unicode/icu/CollatorICU.cpp.o
[  3%] Building CXX object Source/WTF/wtf/CMakeFiles/WTF.dir/OSAllocatorPosix.cpp.o
[  3%] Building CXX object Source/WTF/wtf/CMakeFiles/WTF.dir/ThreadIdentifierDataPthreads.cpp.o
[  3%] Building CXX object Source/WTF/wtf/CMakeFiles/WTF.dir/ThreadingPthreads.cpp.o
[  3%] Building CXX object Source/WTF/wtf/CMakeFiles/WTF.dir/qt/MainThreadQt.cpp.o
[  3%] Building CXX object Source/WTF/wtf/CMakeFiles/WTF.dir/qt/RunLoopQt.cpp.o
[  3%] Building CXX object Source/WTF/wtf/CMakeFiles/WTF.dir/text/qt/StringQt.cpp.o
[  3%] Building CXX object Source/WTF/wtf/CMakeFiles/WTF.dir/UniStdExtras.cpp.o
[  3%] Building CXX object Source/WTF/wtf/CMakeFiles/WTF.dir/qt/WorkQueueQt.cpp.o
[  3%] Building CXX object Source/WTF/wtf/CMakeFiles/WTF.dir/glib/GRefPtr.cpp.o
[  3%] Linking CXX static library ../../../lib/libWTF.a
[  3%] Built target WTF
[  3%] Generating ../../DerivedSources/JavaScriptCore/Bytecodes.h, ../../DerivedSources/JavaScriptCore/InitBytecodes.asm
[  3%] Generating ../../DerivedSources/JavaScriptCore/LLIntDesiredOffsets.h
[  3%] Building CXX object Source/JavaScriptCore/CMakeFiles/LLIntOffsetsExtractor.dir/llint/LLIntOffsetsExtractor.cpp.o
[  3%] Linking CXX executable ../../bin/LLIntOffsetsExtractor
/usr/bin/ld.gold: pack-relative-relocs: unknown -z option
/usr/bin/ld.gold: use the --help option for usage information
collect2: error: ld returned 1 exit status
make[2]: *** [Source/JavaScriptCore/CMakeFiles/LLIntOffsetsExtractor.dir/build.make:139: bin/LLIntOffsetsExtractor] Error 1
make[1]: *** [CMakeFiles/Makefile2:1527: Source/JavaScriptCore/CMakeFiles/LLIntOffsetsExtractor.dir/all] Error 2
make: *** [Makefile:166: all] Error 2
==> ERROR: A failure occurred in build().
    Aborting...
 -> error making: qt5-webkit-exit status 4
==> Making package: goldendict 1:1.5.0-3 (Wed 20 Mar 2024 11:27:47 AM EDT)
==> Checking runtime dependencies...
==> Missing dependencies:
  -> qt5-webkit
==> Checking buildtime dependencies...
==> ERROR: Could not resolve all dependencies.
 -> error making: goldendict-exit status 8
 -> Failed to install the following packages. Manual intervention is required:
qt5-webkit - exit status 4
goldendict - exit status 8
[alnone@alnone-inspiron3583 ~]$

[alnone@alnone-inspiron3583 ~]$ LANG=C yay -S qt5-webkit
AUR Explicit (1): qt5-webkit-5.212.0alpha4-22
:: PKGBUILD up to date, skipping download: qt5-webkit
  1 qt5-webkit                       (Build Files Exist)
==> Packages to cleanBuild?
==> [N]one [A]ll [Ab]ort [I]nstalled [No]tInstalled or (1 2 3, 1-3, ^4)
==> N
  1 qt5-webkit                       (Build Files Exist)
==> Diffs to show?
==> [N]one [A]ll [Ab]ort [I]nstalled [No]tInstalled or (1 2 3, 1-3, ^4)
==> N
==> Making package: qt5-webkit 5.212.0alpha4-22 (Wed 20 Mar 2024 11:40:43 AM EDT)
==> Retrieving sources...
  -> Found qtwebkit-5.212.0-alpha4.tar.xz
  -> Found qtwebkit-cstdint.patch
  -> Found icu68.patch
  -> Found glib-2.68.patch
  -> Found qt5-webkit-python-3.9.patch
  -> Found qt5-webkit-bison-3.7.patch
==> WARNING: Skipping verification of source file PGP signatures.
==> Validating source files with sha256sums...
    qtwebkit-5.212.0-alpha4.tar.xz ... Passed
    qtwebkit-cstdint.patch ... Passed
    icu68.patch ... Passed
    glib-2.68.patch ... Passed
    qt5-webkit-python-3.9.patch ... Passed
    qt5-webkit-bison-3.7.patch ... Passed
:: (1/1) Parsing SRCINFO: qt5-webkit
==> Making package: qt5-webkit 5.212.0alpha4-22 (Wed 20 Mar 2024 11:40:44 AM EDT)
==> Checking runtime dependencies...
==> Checking buildtime dependencies...
==> Retrieving sources...
  -> Found qtwebkit-5.212.0-alpha4.tar.xz
  -> Found qtwebkit-cstdint.patch
  -> Found icu68.patch
  -> Found glib-2.68.patch
  -> Found qt5-webkit-python-3.9.patch
  -> Found qt5-webkit-bison-3.7.patch
==> Validating source files with sha256sums...
    qtwebkit-5.212.0-alpha4.tar.xz ... Passed
    qtwebkit-cstdint.patch ... Passed
    icu68.patch ... Passed
    glib-2.68.patch ... Passed
    qt5-webkit-python-3.9.patch ... Passed
    qt5-webkit-bison-3.7.patch ... Passed
==> Removing existing $srcdir/ directory...
==> Extracting sources...
  -> Extracting qtwebkit-5.212.0-alpha4.tar.xz with bsdtar
==> Starting prepare()...
patching file Source/WebCore/platform/text/TextCodecICU.cpp
patching file Source/WebCore/platform/text/icu/UTextProvider.h
patching file Source/WebCore/platform/text/icu/UTextProviderLatin1.cpp
patching file Source/WebCore/platform/text/icu/UTextProviderUTF16.cpp
patching file Source/WTF/wtf/glib/GRefPtr.h
Hunk #1 succeeded at 29 with fuzz 2.
patching file Source/JavaScriptCore/generate-bytecode-files
patching file Source/WebCore/css/makegrammar.pl
patching file Source/ThirdParty/ANGLE/src/common/mathutil.h
==> Sources are ready.
==> Making package: qt5-webkit 5.212.0alpha4-22 (Wed 20 Mar 2024 11:40:46 AM EDT)
==> Checking runtime dependencies...
==> Checking buildtime dependencies...
==> WARNING: Using existing $srcdir/ tree
==> Removing existing $pkgdir/ directory...
==> Starting build()...
-- The C compiler identification is GNU 13.2.1
-- The CXX compiler identification is GNU 13.2.1
-- Detecting C compiler ABI info
-- Detecting C compiler ABI info - done
-- Check for working C compiler: /usr/bin/cc - skipped
-- Detecting C compile features
-- Detecting C compile features - done
-- Detecting CXX compiler ABI info
-- Detecting CXX compiler ABI info - done
-- Check for working CXX compiler: /usr/bin/c++ - skipped
-- Detecting CXX compile features
-- Detecting CXX compile features - done
-- Found BISON: /usr/bin/bison (found suitable version "3.8.2", minimum required is "2.1") 
-- Found Gperf: /usr/bin/gperf (Required is at least version "3.0.1") 
-- Found Perl: /usr/bin/perl (found suitable version "5.38.2", minimum required is "5.10.0") 
-- Found PythonInterp: /usr/bin/python3 (found suitable version "3.11.8", minimum required is "2.7.0") 
-- Found Ruby: /usr/bin/ruby (found suitable version "3.0.6", minimum required is "1.9") 
-- Looking for include file features.h
-- Looking for include file features.h - found
-- Found PkgConfig: /usr/bin/pkg-config (found version "2.1.1") 
-- Checking for module 'sqlite3'
--   Found sqlite3, version 3.45.2
-- Found Sqlite: /usr/include  
-- Performing Test CMAKE_HAVE_LIBC_PTHREAD
-- Performing Test CMAKE_HAVE_LIBC_PTHREAD - Success
-- Found Threads: TRUE  
-- Found JPEG: /usr/lib/libjpeg.so (found version "80") 
-- Found ZLIB: /usr/lib/libz.so (found version "1.3.1")  
-- Found PNG: /usr/lib/libpng.so (found version "1.6.43") 
-- Checking for module 'icu-uc'
--   Found icu-uc, version 74.2
-- Checking for module 'icu-i18n'
--   Found icu-i18n, version 74.2
-- Found ICU header files in /usr/include
-- Found ICU libraries: /usr/lib/libicuuc.so
-- Found LibXml2: /usr/lib/libxml2.so (found suitable version "2.12.6", minimum required is "2.8.0") 
-- Could NOT find Dwz (missing: DWZ_EXECUTABLE) (Required is at least version "0.13")
-- Found WebP: /usr/include  
-- Qt OpenGL implementation: GL
-- Qt OpenGL libraries: Qt5::Gui_GL
-- Qt EGL libraries: Qt5::Gui_EGL
-- Performing Test Qt5Gui_PRIVATE_HEADER_FOUND
-- Performing Test Qt5Gui_PRIVATE_HEADER_FOUND - Success
-- Performing Test Qt5Network_PRIVATE_HEADER_FOUND
-- Performing Test Qt5Network_PRIVATE_HEADER_FOUND - Success
-- Performing Test Qt5Quick_PRIVATE_HEADER_FOUND
-- Performing Test Qt5Quick_PRIVATE_HEADER_FOUND - Success
-- Found X11: /usr/include   
-- Looking for XOpenDisplay in /usr/lib/libX11.so;/usr/lib/libXext.so
-- Looking for XOpenDisplay in /usr/lib/libX11.so;/usr/lib/libXext.so - found
-- Looking for gethostbyname
-- Looking for gethostbyname - found
-- Looking for connect
-- Looking for connect - found
-- Looking for remove
-- Looking for remove - found
-- Looking for shmat
-- Looking for shmat - found
-- Looking for IceConnectionNumber in ICE
-- Looking for IceConnectionNumber in ICE - found
-- Found GLIB: /usr/include/glib-2.0;/usr/lib/glib-2.0/include (found suitable version "2.78.4", minimum required is "2.36") 
-- Checking for module 'gstreamer-1.0 >= 1.0.3'
--   Found gstreamer-1.0, version 1.24.0
-- Checking for module 'gstreamer-base-1.0 >= 1.0.3'
--   Found gstreamer-base-1.0, version 1.24.0
-- Checking for module 'gstreamer-app-1.0 >= 1.0.3'
--   Found gstreamer-app-1.0, version 1.24.0
-- Checking for module 'gstreamer-audio-1.0 >= 1.0.3'
--   Found gstreamer-audio-1.0, version 1.24.0
-- Checking for module 'gstreamer-fft-1.0 >= 1.0.3'
--   Found gstreamer-fft-1.0, version 1.24.0
-- Checking for module 'gstreamer-gl-1.0>=1.6.0'
--   Found gstreamer-gl-1.0, version 1.24.0
-- Checking for module 'gstreamer-mpegts-1.0>=1.4.0'
--   Found gstreamer-mpegts-1.0, version 1.24.0
-- Checking for module 'gstreamer-pbutils-1.0 >= 1.0.3'
--   Found gstreamer-pbutils-1.0, version 1.24.0
-- Checking for module 'gstreamer-tag-1.0 >= 1.0.3'
--   Found gstreamer-tag-1.0, version 1.24.0
-- Checking for module 'gstreamer-video-1.0 >= 1.0.3'
--   Found gstreamer-video-1.0, version 1.24.0
-- Found GStreamer: GSTREAMER_INCLUDE_DIRS;GSTREAMER_LIBRARIES;GSTREAMER_VERSION;GSTREAMER_BASE_INCLUDE_DIRS;GSTREAMER_BASE_LIBRARIES;GSTREAMER_APP_INCLUDE_DIRS;GSTREAMER_APP_LIBRARIES;GSTREAMER_PBUTILS_INCLUDE_DIRS;GSTREAMER_PBUTILS_LIBRARIES;GSTREAMER_VIDEO_INCLUDE_DIRS;GSTREAMER_VIDEO_LIBRARIES;GSTREAMER_MPEGTS_INCLUDE_DIRS;GSTREAMER_MPEGTS_LIBRARIES;GSTREAMER_TAG_INCLUDE_DIRS;GSTREAMER_TAG_LIBRARIES;GSTREAMER_GL_INCLUDE_DIRS;GSTREAMER_GL_LIBRARIES;GSTREAMER_AUDIO_INCLUDE_DIRS;GSTREAMER_AUDIO_LIBRARIES;GSTREAMER_FFT_INCLUDE_DIRS;GSTREAMER_FFT_LIBRARIES (Required is at least version "1.0.3") 
-- Found Hyphen: /usr/include  
-- Checking for module 'libwoff2dec'
--   Found libwoff2dec, version 1.0.2
-- Found WOFF2Dec: /usr/include (found suitable version "1.0.2", minimum required is "1.0.1") 
-- Using system WOFF2Dec library.
-- The following OPTIONAL packages have been found:

 * JPEG
 * WebP
 * Qt5OpenGL (required version >= 5.2.0)
 * PkgConfig
 * WOFF2Dec (required version >= 1.0.1)

-- The following REQUIRED packages have been found:

 * BISON (required version >= 2.1)
 * Gperf (required version >= 3.0.1)
 * Perl (required version >= 5.10.0)
 * PythonInterp (required version >= 2.7.0)
 * Ruby (required version >= 1.9)
 * Sqlite
 * Threads
 * PNG
 * ZLIB
 * ICU
 * LibXml2 (required version >= 2.8.0)
 * Qt5Core
 * Qt5Gui
 * Qt5Network
 * Qt5Widgets
 * Qt5Test
 * Qt5QuickTest
 * Qt5Positioning
 * Qt5Sensors
 * Qt5PrintSupport
   Required for ENABLE_PRINT_SUPPORT=ON
 * Qt5Qml (required version >= 5.15.13)
 * Qt5QmlModels (required version >= 5.15.13)
 * Qt5Quick
 * Qt5WebChannel
 * Qt5 (required version >= 5.2.0)
 * X11
 * GLIB (required version >= 2.36)
 * GStreamer (required version >= 1.0.3)
 * Hyphen

-- The following OPTIONAL packages have not been found:

 * Dwz (required version >= 0.13)

-- Installing in the same prefix as Qt, adopting their path scheme.
-- Using platform-specific CMakeLists: /home/alnone/.cache/yay/qt5-webkit/src/qtwebkit-5.212.0-alpha4/Source/WTF/wtf/PlatformQt.cmake
-- Looking for clock_gettime
-- Looking for clock_gettime - found
-- Using platform-specific CMakeLists: /home/alnone/.cache/yay/qt5-webkit/src/qtwebkit-5.212.0-alpha4/Source/JavaScriptCore/PlatformQt.cmake
-- Using platform-specific CMakeLists: /home/alnone/.cache/yay/qt5-webkit/src/qtwebkit-5.212.0-alpha4/Source/JavaScriptCore/shell/PlatformQt.cmake
-- All-in-One build is enabled.
-- Using platform-specific CMakeLists: /home/alnone/.cache/yay/qt5-webkit/src/qtwebkit-5.212.0-alpha4/Source/WebCore/PlatformQt.cmake
-- Using platform-specific CMakeLists: /home/alnone/.cache/yay/qt5-webkit/src/qtwebkit-5.212.0-alpha4/Source/WebKit/PlatformQt.cmake
-- Performing Test ATOMIC_INT64_IS_BUILTIN
-- Performing Test ATOMIC_INT64_IS_BUILTIN - Success
-- Looking for shm_open
-- Looking for shm_open - found
-- Using platform-specific CMakeLists: /home/alnone/.cache/yay/qt5-webkit/src/qtwebkit-5.212.0-alpha4/Source/WebKit2/PlatformQt.cmake
-- Using platform-specific CMakeLists: /home/alnone/.cache/yay/qt5-webkit/src/qtwebkit-5.212.0-alpha4/Source/PlatformQt.cmake
-- Enabled features:
--  ENABLE_ACCELERATED_2D_CANVAS ............ ON
--  ENABLE_ALLINONE_BUILD                     ON
--  ENABLE_API_TESTS ........................ ON
--  ENABLE_CSS_GRID_LAYOUT                    ON
--  ENABLE_DATABASE_PROCESS ................. ON
--  ENABLE_DATALIST_ELEMENT                   ON
--  ENABLE_DEVICE_ORIENTATION ............... ON
--  ENABLE_DRAG_SUPPORT                       ON
--  ENABLE_FULLSCREEN_API ................... ON
--  ENABLE_GAMEPAD_DEPRECATED                 ON
--  ENABLE_GEOLOCATION ...................... ON
--  ENABLE_ICONDATABASE                       ON
--  ENABLE_INDEXED_DATABASE ................. ON
--  ENABLE_INSPECTOR_UI                       ON
--  ENABLE_JIT .............................. ON
--  ENABLE_LEGACY_WEB_AUDIO                   ON
--  ENABLE_LINK_PREFETCH .................... ON
--  ENABLE_MEDIA_SOURCE                       ON
--  ENABLE_NETSCAPE_PLUGIN_API .............. ON
--  ENABLE_OPENGL                             ON
--  ENABLE_PRINT_SUPPORT .................... ON
--  ENABLE_QT_GESTURE_EVENTS                  ON
--  ENABLE_QT_WEBCHANNEL .................... ON
--  ENABLE_SAMPLING_PROFILER                  ON
--  ENABLE_SPELLCHECK ....................... ON
--  ENABLE_TOUCH_EVENTS                       ON
--  ENABLE_VIDEO ............................ ON
--  ENABLE_WEBKIT2                            ON
--  ENABLE_WEB_AUDIO ........................ ON
--  ENABLE_X11_TARGET                         ON
--  ENABLE_XSLT ............................. OFF
--  USE_GSTREAMER                             ON
--  USE_LIBHYPHEN ........................... ON
--  USE_LIBJPEG                               ON
--  USE_MEDIA_FOUNDATION .................... OFF
--  USE_QT_MULTIMEDIA                         OFF
--  USE_SYSTEM_MALLOC ....................... OFF
--  USE_WOFF2                                 ON
-- Configuring done (10.4s)
-- Generating done (0.6s)
-- Build files have been written to: /home/alnone/.cache/yay/qt5-webkit/src/build
[  0%] Built target WebKit2-forwarding-headers
[  0%] Generating ../../DerivedSources/ForwardingHeaders/JavaScriptCore/Scripts/UpdateContents.py
[  0%] Generating ../../DerivedSources/ForwardingHeaders/JavaScriptCore/Scripts/builtins_generate_combined_header.py
[  0%] Generating ../../DerivedSources/ForwardingHeaders/JavaScriptCore/Scripts/builtins_generate_combined_implementation.py
[  0%] Generating ../../DerivedSources/ForwardingHeaders/JavaScriptCore/Scripts/builtins_generate_separate_header.py
[  0%] Generating ../../DerivedSources/ForwardingHeaders/JavaScriptCore/Scripts/builtins_generate_separate_implementation.py
[  0%] Generating ../../DerivedSources/ForwardingHeaders/JavaScriptCore/Scripts/builtins_generator.py
[  0%] Generating ../../DerivedSources/ForwardingHeaders/JavaScriptCore/Scripts/builtins_model.py
[  0%] Generating ../../DerivedSources/ForwardingHeaders/JavaScriptCore/Scripts/builtins_templates.py
[  0%] Generating ../../DerivedSources/ForwardingHeaders/JavaScriptCore/Scripts/cssmin.py
[  0%] Generating ../../DerivedSources/ForwardingHeaders/JavaScriptCore/Scripts/generate-combined-inspector-json.py
[  0%] Generating ../../DerivedSources/ForwardingHeaders/JavaScriptCore/Scripts/generate-js-builtins.py
[  0%] Generating ../../DerivedSources/ForwardingHeaders/JavaScriptCore/Scripts/inline-and-minify-stylesheets-and-scripts.py
[  0%] Generating ../../DerivedSources/ForwardingHeaders/JavaScriptCore/Scripts/jsmin.py
[  0%] Generating ../../DerivedSources/ForwardingHeaders/JavaScriptCore/Scripts/lazywriter.py
[  0%] Generating ../../DerivedSources/ForwardingHeaders/JavaScriptCore/Scripts/make-js-file-arrays.py
[  0%] Generating ../../DerivedSources/ForwardingHeaders/JavaScriptCore/Scripts/wkbuiltins.py
[  0%] Generating ../../DerivedSources/ForwardingHeaders/JavaScriptCore/Scripts/xxd.pl
[  0%] Built target stageSharedScripts
[  0%] Building CXX object Source/bmalloc/CMakeFiles/bmalloc.dir/bmalloc/Allocator.cpp.o
[  0%] Building CXX object Source/bmalloc/CMakeFiles/bmalloc.dir/bmalloc/Cache.cpp.o
[  0%] Building CXX object Source/bmalloc/CMakeFiles/bmalloc.dir/bmalloc/Deallocator.cpp.o
[  0%] Building CXX object Source/bmalloc/CMakeFiles/bmalloc.dir/bmalloc/Environment.cpp.o
[  0%] Building CXX object Source/bmalloc/CMakeFiles/bmalloc.dir/bmalloc/Heap.cpp.o
[  0%] Building CXX object Source/bmalloc/CMakeFiles/bmalloc.dir/bmalloc/Logging.cpp.o
[  0%] Building CXX object Source/bmalloc/CMakeFiles/bmalloc.dir/bmalloc/ObjectType.cpp.o
[  0%] Building CXX object Source/bmalloc/CMakeFiles/bmalloc.dir/bmalloc/StaticMutex.cpp.o
[  0%] Building CXX object Source/bmalloc/CMakeFiles/bmalloc.dir/bmalloc/VMHeap.cpp.o
[  0%] Building CXX object Source/bmalloc/CMakeFiles/bmalloc.dir/bmalloc/XLargeMap.cpp.o
[  0%] Building CXX object Source/bmalloc/CMakeFiles/bmalloc.dir/bmalloc/mbmalloc.cpp.o
[  1%] Linking CXX static library ../../lib/libbmalloc.a
[  1%] Built target bmalloc
[  2%] Generating WorkQueueQt.moc
[  2%] Generating MainThreadQt.moc
[  2%] Generating RunLoopQt.moc
[  2%] Building CXX object Source/WTF/wtf/CMakeFiles/WTF.dir/Assertions.cpp.o
[  2%] Building CXX object Source/WTF/wtf/CMakeFiles/WTF.dir/Atomics.cpp.o
[  2%] Building CXX object Source/WTF/wtf/CMakeFiles/WTF.dir/BitVector.cpp.o
[  2%] Building CXX object Source/WTF/wtf/CMakeFiles/WTF.dir/CompilationThread.cpp.o
[  2%] Building CXX object Source/WTF/wtf/CMakeFiles/WTF.dir/CryptographicUtilities.cpp.o
[  2%] Building CXX object Source/WTF/wtf/CMakeFiles/WTF.dir/CryptographicallyRandomNumber.cpp.o
[  2%] Building CXX object Source/WTF/wtf/CMakeFiles/WTF.dir/CurrentTime.cpp.o
[  2%] Building CXX object Source/WTF/wtf/CMakeFiles/WTF.dir/DataLog.cpp.o
[  2%] Building CXX object Source/WTF/wtf/CMakeFiles/WTF.dir/DateMath.cpp.o
[  2%] Building CXX object Source/WTF/wtf/CMakeFiles/WTF.dir/DecimalNumber.cpp.o
[  2%] Building CXX object Source/WTF/wtf/CMakeFiles/WTF.dir/FastBitVector.cpp.o
[  2%] Building CXX object Source/WTF/wtf/CMakeFiles/WTF.dir/FastMalloc.cpp.o
In file included from /home/alnone/.cache/yay/qt5-webkit/src/qtwebkit-5.212.0-alpha4/Source/WTF/wtf/StdLibExtras.h:33,
                 from /home/alnone/.cache/yay/qt5-webkit/src/qtwebkit-5.212.0-alpha4/Source/WTF/wtf/FastMalloc.h:26,
                 from /home/alnone/.cache/yay/qt5-webkit/src/qtwebkit-5.212.0-alpha4/Source/WTF/config.h:51,
                 from /home/alnone/.cache/yay/qt5-webkit/src/qtwebkit-5.212.0-alpha4/Source/WTF/wtf/FastMalloc.cpp:27:
/home/alnone/.cache/yay/qt5-webkit/src/qtwebkit-5.212.0-alpha4/Source/WTF/wtf/CheckedArithmetic.h: In instantiation of 'const WTF::Checked<T, OverflowHandler> WTF::Checked<T, OverflowHandler>::operator*=(U) [with U = long unsigned int; T = long unsigned int; OverflowHandler = WTF::CrashOnOverflow]':
/home/alnone/.cache/yay/qt5-webkit/src/qtwebkit-5.212.0-alpha4/Source/WTF/wtf/FastMalloc.cpp:199:20:   required from here
/home/alnone/.cache/yay/qt5-webkit/src/qtwebkit-5.212.0-alpha4/Source/WTF/wtf/CheckedArithmetic.h:597:17: warning: implicitly-declared 'constexpr WTF::Checked<long unsigned int>::Checked(const WTF::Checked<long unsigned int>&)' is deprecated [-Wdeprecated-copy]
  597 |         return *this;
      |                 ^~~~
/home/alnone/.cache/yay/qt5-webkit/src/qtwebkit-5.212.0-alpha4/Source/WTF/wtf/CheckedArithmetic.h:496:20: note: because 'WTF::Checked<long unsigned int>' has user-provided 'const WTF::Checked<T, OverflowHandler>& WTF::Checked<T, OverflowHandler>::operator=(WTF::Checked<T, OverflowHandler>) [with T = long unsigned int; OverflowHandler = WTF::CrashOnOverflow]'
  496 |     const Checked& operator=(Checked rhs)
      |                    ^~~~~~~~
/home/alnone/.cache/yay/qt5-webkit/src/qtwebkit-5.212.0-alpha4/Source/WTF/wtf/CheckedArithmetic.h: In instantiation of 'const WTF::Checked<T, OverflowHandler> WTF::Checked<T, OverflowHandler>::operator*=(U) [with U = long unsigned int; T = long unsigned int; OverflowHandler = WTF::RecordOverflow]':
/home/alnone/.cache/yay/qt5-webkit/src/qtwebkit-5.212.0-alpha4/Source/WTF/wtf/FastMalloc.cpp:247:20:   required from here
/home/alnone/.cache/yay/qt5-webkit/src/qtwebkit-5.212.0-alpha4/Source/WTF/wtf/CheckedArithmetic.h:597:17: warning: implicitly-declared 'constexpr WTF::Checked<long unsigned int, WTF::RecordOverflow>::Checked(const WTF::Checked<long unsigned int, WTF::RecordOverflow>&)' is deprecated [-Wdeprecated-copy]
  597 |         return *this;
      |                 ^~~~
/home/alnone/.cache/yay/qt5-webkit/src/qtwebkit-5.212.0-alpha4/Source/WTF/wtf/CheckedArithmetic.h:496:20: note: because 'WTF::Checked<long unsigned int, WTF::RecordOverflow>' has user-provided 'const WTF::Checked<T, OverflowHandler>& WTF::Checked<T, OverflowHandler>::operator=(WTF::Checked<T, OverflowHandler>) [with T = long unsigned int; OverflowHandler = WTF::RecordOverflow]'
  496 |     const Checked& operator=(Checked rhs)
      |                    ^~~~~~~~
[  2%] Building CXX object Source/WTF/wtf/CMakeFiles/WTF.dir/FilePrintStream.cpp.o
[  2%] Building CXX object Source/WTF/wtf/CMakeFiles/WTF.dir/FunctionDispatcher.cpp.o
[  2%] Building CXX object Source/WTF/wtf/CMakeFiles/WTF.dir/GregorianDateTime.cpp.o
[  2%] Building CXX object Source/WTF/wtf/CMakeFiles/WTF.dir/HashTable.cpp.o
[  2%] Building CXX object Source/WTF/wtf/CMakeFiles/WTF.dir/Lock.cpp.o
[  2%] Building CXX object Source/WTF/wtf/CMakeFiles/WTF.dir/MD5.cpp.o
[  2%] Building CXX object Source/WTF/wtf/CMakeFiles/WTF.dir/MainThread.cpp.o
[  2%] Building CXX object Source/WTF/wtf/CMakeFiles/WTF.dir/MediaTime.cpp.o
[  2%] Building CXX object Source/WTF/wtf/CMakeFiles/WTF.dir/MetaAllocator.cpp.o
[  2%] Building CXX object Source/WTF/wtf/CMakeFiles/WTF.dir/NumberOfCores.cpp.o
[  2%] Building CXX object Source/WTF/wtf/CMakeFiles/WTF.dir/OSRandomSource.cpp.o
[  2%] Building CXX object Source/WTF/wtf/CMakeFiles/WTF.dir/PageBlock.cpp.o
[  2%] Building CXX object Source/WTF/wtf/CMakeFiles/WTF.dir/ParallelHelperPool.cpp.o
[  2%] Building CXX object Source/WTF/wtf/CMakeFiles/WTF.dir/ParallelJobsGeneric.cpp.o
[  2%] Building CXX object Source/WTF/wtf/CMakeFiles/WTF.dir/ParkingLot.cpp.o
[  2%] Building CXX object Source/WTF/wtf/CMakeFiles/WTF.dir/PrintStream.cpp.o
[  2%] Building CXX object Source/WTF/wtf/CMakeFiles/WTF.dir/RAMSize.cpp.o
[  2%] Building CXX object Source/WTF/wtf/CMakeFiles/WTF.dir/RandomNumber.cpp.o
[  2%] Building CXX object Source/WTF/wtf/CMakeFiles/WTF.dir/RefCountedLeakCounter.cpp.o
[  2%] Building CXX object Source/WTF/wtf/CMakeFiles/WTF.dir/RefCounter.cpp.o
[  2%] Building CXX object Source/WTF/wtf/CMakeFiles/WTF.dir/RunLoop.cpp.o
[  2%] Building CXX object Source/WTF/wtf/CMakeFiles/WTF.dir/SHA1.cpp.o
[  2%] Building CXX object Source/WTF/wtf/CMakeFiles/WTF.dir/SixCharacterHash.cpp.o
[  2%] Building CXX object Source/WTF/wtf/CMakeFiles/WTF.dir/StackBounds.cpp.o
[  2%] Building CXX object Source/WTF/wtf/CMakeFiles/WTF.dir/StackStats.cpp.o
[  2%] Building CXX object Source/WTF/wtf/CMakeFiles/WTF.dir/StringPrintStream.cpp.o
[  2%] Building CXX object Source/WTF/wtf/CMakeFiles/WTF.dir/Threading.cpp.o
[  2%] Building CXX object Source/WTF/wtf/CMakeFiles/WTF.dir/WTFThreadData.cpp.o
[  2%] Building CXX object Source/WTF/wtf/CMakeFiles/WTF.dir/WordLock.cpp.o
[  2%] Building CXX object Source/WTF/wtf/CMakeFiles/WTF.dir/WorkQueue.cpp.o
[  2%] Building CXX object Source/WTF/wtf/CMakeFiles/WTF.dir/dtoa.cpp.o
[  3%] Building CXX object Source/WTF/wtf/CMakeFiles/WTF.dir/dtoa/bignum-dtoa.cc.o
[  3%] Building CXX object Source/WTF/wtf/CMakeFiles/WTF.dir/dtoa/bignum.cc.o
[  3%] Building CXX object Source/WTF/wtf/CMakeFiles/WTF.dir/dtoa/cached-powers.cc.o
[  3%] Building CXX object Source/WTF/wtf/CMakeFiles/WTF.dir/dtoa/diy-fp.cc.o
[  3%] Building CXX object Source/WTF/wtf/CMakeFiles/WTF.dir/dtoa/double-conversion.cc.o
[  3%] Building CXX object Source/WTF/wtf/CMakeFiles/WTF.dir/dtoa/fast-dtoa.cc.o
[  3%] Building CXX object Source/WTF/wtf/CMakeFiles/WTF.dir/dtoa/fixed-dtoa.cc.o
[  3%] Building CXX object Source/WTF/wtf/CMakeFiles/WTF.dir/dtoa/strtod.cc.o
[  3%] Building CXX object Source/WTF/wtf/CMakeFiles/WTF.dir/text/AtomicString.cpp.o
[  3%] Building CXX object Source/WTF/wtf/CMakeFiles/WTF.dir/text/AtomicStringImpl.cpp.o
[  3%] Building CXX object Source/WTF/wtf/CMakeFiles/WTF.dir/text/AtomicStringTable.cpp.o
[  3%] Building CXX object Source/WTF/wtf/CMakeFiles/WTF.dir/text/Base64.cpp.o
[  3%] Building CXX object Source/WTF/wtf/CMakeFiles/WTF.dir/text/CString.cpp.o
[  3%] Building CXX object Source/WTF/wtf/CMakeFiles/WTF.dir/text/StringBuilder.cpp.o
[  3%] Building CXX object Source/WTF/wtf/CMakeFiles/WTF.dir/text/StringImpl.cpp.o
In file included from /home/alnone/.cache/yay/qt5-webkit/src/qtwebkit-5.212.0-alpha4/Source/WTF/wtf/StdLibExtras.h:33,
                 from /home/alnone/.cache/yay/qt5-webkit/src/qtwebkit-5.212.0-alpha4/Source/WTF/wtf/FastMalloc.h:26,
                 from /home/alnone/.cache/yay/qt5-webkit/src/qtwebkit-5.212.0-alpha4/Source/WTF/config.h:51,
                 from /home/alnone/.cache/yay/qt5-webkit/src/qtwebkit-5.212.0-alpha4/Source/WTF/wtf/text/StringImpl.cpp:25:
/home/alnone/.cache/yay/qt5-webkit/src/qtwebkit-5.212.0-alpha4/Source/WTF/wtf/CheckedArithmetic.h: In instantiation of 'WTF::Checked<typename WTF::Result<U, V>::ResultType, OverflowHandler> WTF::operator*(Checked<U, OverflowHandler>, V) [with U = long unsigned int; V = long unsigned int; OverflowHandler = CrashOnOverflow; typename Result<U, V>::ResultType = long unsigned int]':
/home/alnone/.cache/yay/qt5-webkit/src/qtwebkit-5.212.0-alpha4/Source/WTF/wtf/text/StringBuffer.h:44:90:   required from 'WTF::StringBuffer<T>::StringBuffer(unsigned int) [with CharType = unsigned char]'
/home/alnone/.cache/yay/qt5-webkit/src/qtwebkit-5.212.0-alpha4/Source/WTF/wtf/text/StringImpl.cpp:817:28:   required from 'WTF::Ref<WTF::StringImpl> WTF::StringImpl::removeCharacters(const CharType*, WTF::CharacterMatchFunctionPtr) [with CharType = unsigned char; WTF::CharacterMatchFunctionPtr = bool (*)(char16_t)]'
/home/alnone/.cache/yay/qt5-webkit/src/qtwebkit-5.212.0-alpha4/Source/WTF/wtf/text/StringImpl.cpp:841:32:   required from here
/home/alnone/.cache/yay/qt5-webkit/src/qtwebkit-5.212.0-alpha4/Source/WTF/wtf/CheckedArithmetic.h:761:16: warning: implicitly-declared 'constexpr WTF::Checked<long unsigned int>::Checked(const WTF::Checked<long unsigned int>&)' is deprecated [-Wdeprecated-copy]
  761 |     return lhs * Checked<V, OverflowHandler>(rhs);
      |            ~~~~^~~~~~~~~~~~~~~~~~~~~~~~~~~~~~~~~~
/home/alnone/.cache/yay/qt5-webkit/src/qtwebkit-5.212.0-alpha4/Source/WTF/wtf/CheckedArithmetic.h:496:20: note: because 'WTF::Checked<long unsigned int>' has user-provided 'const WTF::Checked<T, OverflowHandler>& WTF::Checked<T, OverflowHandler>::operator=(WTF::Checked<T, OverflowHandler>) [with T = long unsigned int; OverflowHandler = WTF::CrashOnOverflow]'
  496 |     const Checked& operator=(Checked rhs)
      |                    ^~~~~~~~
/home/alnone/.cache/yay/qt5-webkit/src/qtwebkit-5.212.0-alpha4/Source/WTF/wtf/CheckedArithmetic.h:737:173: note:   initializing argument 1 of 'WTF::Checked<typename WTF::Result<U, V>::ResultType, OverflowHandler> WTF::operator*(Checked<U, OverflowHandler>, Checked<V, OverflowHandler>) [with U = long unsigned int; V = long unsigned int; OverflowHandler = CrashOnOverflow; typename Result<U, V>::ResultType = long unsigned int]'
  737 | tType, OverflowHandler> operator*(Checked<U, OverflowHandler> lhs, Checked<V, OverflowHandler> rhs)
      |                                   ~~~~~~~~~~~~~~~~~~~~~~~~~~~~^~~

[  3%] Building CXX object Source/WTF/wtf/CMakeFiles/WTF.dir/text/StringStatics.cpp.o
[  3%] Building CXX object Source/WTF/wtf/CMakeFiles/WTF.dir/text/StringView.cpp.o
[  3%] Building CXX object Source/WTF/wtf/CMakeFiles/WTF.dir/text/SymbolRegistry.cpp.o
[  3%] Building CXX object Source/WTF/wtf/CMakeFiles/WTF.dir/text/WTFString.cpp.o
[  3%] Building CXX object Source/WTF/wtf/CMakeFiles/WTF.dir/threads/BinarySemaphore.cpp.o
[  3%] Building CXX object Source/WTF/wtf/CMakeFiles/WTF.dir/unicode/UTF8.cpp.o
[  3%] Building CXX object Source/WTF/wtf/CMakeFiles/WTF.dir/unicode/icu/CollatorICU.cpp.o
[  3%] Building CXX object Source/WTF/wtf/CMakeFiles/WTF.dir/OSAllocatorPosix.cpp.o
[  3%] Building CXX object Source/WTF/wtf/CMakeFiles/WTF.dir/ThreadIdentifierDataPthreads.cpp.o
[  3%] Building CXX object Source/WTF/wtf/CMakeFiles/WTF.dir/ThreadingPthreads.cpp.o
[  3%] Building CXX object Source/WTF/wtf/CMakeFiles/WTF.dir/qt/MainThreadQt.cpp.o
[  3%] Building CXX object Source/WTF/wtf/CMakeFiles/WTF.dir/qt/RunLoopQt.cpp.o
[  3%] Building CXX object Source/WTF/wtf/CMakeFiles/WTF.dir/text/qt/StringQt.cpp.o
[  3%] Building CXX object Source/WTF/wtf/CMakeFiles/WTF.dir/UniStdExtras.cpp.o
[  3%] Building CXX object Source/WTF/wtf/CMakeFiles/WTF.dir/qt/WorkQueueQt.cpp.o
[  3%] Building CXX object Source/WTF/wtf/CMakeFiles/WTF.dir/glib/GRefPtr.cpp.o
[  3%] Linking CXX static library ../../../lib/libWTF.a
[  3%] Built target WTF
[  3%] Generating ../../DerivedSources/JavaScriptCore/Bytecodes.h, ../../DerivedSources/JavaScriptCore/InitBytecodes.asm
[  3%] Generating ../../DerivedSources/JavaScriptCore/LLIntDesiredOffsets.h
[  3%] Building CXX object Source/JavaScriptCore/CMakeFiles/LLIntOffsetsExtractor.dir/llint/LLIntOffsetsExtractor.cpp.o
[  3%] Linking CXX executable ../../bin/LLIntOffsetsExtractor
/usr/bin/ld.gold: pack-relative-relocs: unknown -z option
/usr/bin/ld.gold: use the --help option for usage information
collect2: error: ld returned 1 exit status
make[2]: *** [Source/JavaScriptCore/CMakeFiles/LLIntOffsetsExtractor.dir/build.make:139: bin/LLIntOffsetsExtractor] Error 1
make[1]: *** [CMakeFiles/Makefile2:1527: Source/JavaScriptCore/CMakeFiles/LLIntOffsetsExtractor.dir/all] Error 2
make: *** [Makefile:166: all] Error 2
==> ERROR: A failure occurred in build().
    Aborting...
 -> error making: qt5-webkit-exit status 4
 -> Failed to install the following packages. Manual intervention is required:
qt5-webkit - exit status 4
[alnone@alnone-inspiron3583 ~]$

[alnone@alnone-inspiron3583 ~]$ inxi -Fxxx
System:
  Host: alnone-inspiron3583 Kernel: 6.8.1-arch1-1 arch: x86_64 bits: 64
    compiler: gcc v: 13.2.1 clocksource: tsc
  Desktop: Xfce v: 4.18.1 tk: Gtk v: 3.24.36 wm: xfwm4 v: 4.18.0
    with: xfce4-panel tools: xfce4-screensaver vt: 7 dm: LightDM v: 1.32.0
    Distro: EndeavourOS base: Arch Linux
Machine:
  Type: Laptop System: Dell product: Inspiron 3583 v: N/A
    serial: <superuser required> Chassis: type: 10 serial: <superuser required>
  Mobo: Dell model: 0WHCP7 v: A00 serial: <superuser required> part-nu: 08CA
    uuid: <superuser required> UEFI: Dell v: 1.5.1 date: 05/30/2019
Battery:
  ID-1: BAT0 charge: 39.9 Wh (100.0%) condition: 39.9/42.0 Wh (95.0%)
    volts: 12.7 min: 11.4 model: SMP DELL VM73283 type: Li-poly serial: 18736
    status: full
CPU:
  Info: quad core model: Intel Core i5-8265U bits: 64 type: MT MCP
    smt: enabled arch: Comet/Whiskey Lake note: check rev: C cache: L1: 256 KiB
    L2: 1024 KiB L3: 6 MiB
  Speed (MHz): avg: 2083 high: 3900 min/max: 400/3900 cores: 1: 3766 2: 400
    3: 3704 4: 3900 5: 400 6: 3701 7: 400 8: 400 bogomips: 28808
  Flags: avx avx2 ht lm nx pae sse sse2 sse3 sse4_1 sse4_2 ssse3 vmx
Graphics:
  Device-1: Intel WhiskeyLake-U GT2 [UHD Graphics 620] vendor: Dell
    driver: i915 v: kernel arch: Gen-9.5 ports: active: eDP-1 empty: HDMI-A-1
    bus-ID: 00:02.0 chip-ID: 8086:3ea0 class-ID: 0300
  Device-2: Realtek Integrated_Webcam_HD driver: uvcvideo type: USB rev: 2.0
    speed: 480 Mb/s lanes: 1 bus-ID: 1-6:3 chip-ID: 0bda:5520 class-ID: 0e02
    serial: 200901010001
  Display: x11 server: X.Org v: 21.1.11 compositor: xfwm4 v: 4.18.0 driver:
    X: loaded: modesetting alternate: fbdev,intel,vesa dri: iris gpu: i915
    display-ID: :0.0 screens: 1
  Screen-1: 0 s-res: 1366x768 s-dpi: 96 s-size: 361x203mm (14.21x7.99")
    s-diag: 414mm (16.31")
  Monitor-1: eDP-1 model: AU Optronics 0x10ec res: 1366x768 hz: 60 dpi: 101
    size: 344x193mm (13.54x7.6") diag: 394mm (15.5") modes: 1366x768
  API: EGL v: 1.5 hw: drv: intel iris platforms: device: 0 drv: iris
    device: 1 drv: swrast surfaceless: drv: iris x11: drv: iris
    inactive: gbm,wayland
  API: OpenGL v: 4.6 compat-v: 4.5 vendor: intel mesa v: 24.0.3-arch1.1
    glx-v: 1.4 direct-render: yes renderer: Mesa Intel UHD Graphics 620 (WHL
    GT2) device-ID: 8086:3ea0
Audio:
  Device-1: Intel Cannon Point-LP High Definition Audio vendor: Dell
    driver: snd_hda_intel v: kernel bus-ID: 00:1f.3 chip-ID: 8086:9dc8
    class-ID: 0403
  API: ALSA v: k6.8.1-arch1-1 status: kernel-api
  Server-1: PipeWire v: 1.0.4 status: active with: 1: pipewire-pulse
    status: active 2: wireplumber status: active 3: pipewire-alsa type: plugin
    4: pw-jack type: plugin
Network:
  Device-1: Realtek RTL810xE PCI Express Fast Ethernet vendor: Dell
    driver: r8169 v: kernel pcie: speed: 2.5 GT/s lanes: 1 port: 3000
    bus-ID: 01:00.0 chip-ID: 10ec:8136 class-ID: 0200
  IF: enp1s0 state: up speed: 100 Mbps duplex: full mac: d8:d0:90:46:9d:0f
Drives:
  Local Storage: total: 238.47 GiB used: 9.48 GiB (4.0%)
  ID-1: /dev/nvme0n1 vendor: Western Digital model: PC SN520 NVMe WDC 256GB
    size: 238.47 GiB speed: 15.8 Gb/s lanes: 2 tech: SSD serial: 191939446503
    fw-rev: 20200012 temp: 44.9 C scheme: GPT
Partition:
  ID-1: / size: 41.9 GiB used: 9.3 GiB (22.2%) fs: ext4 dev: /dev/nvme0n1p7
  ID-2: /boot/efi size: 1.43 GiB used: 191.9 MiB (13.1%) fs: vfat
    dev: /dev/nvme0n1p1
Swap:
  ID-1: swap-1 type: partition size: 1.42 GiB used: 0 KiB (0.0%) priority: -2
    dev: /dev/nvme0n1p2
Sensors:
  System Temperatures: cpu: 78.0 C pch: 57.0 C mobo: 42.0 C
  Fan Speeds (rpm): cpu: 3259
Info:
  Memory: total: 8 GiB available: 7.63 GiB used: 1.99 GiB (26.1%)
  Processes: 238 Power: uptime: 1h 45m states: freeze,mem,disk suspend: deep
    wakeups: 0 hibernate: platform Init: systemd v: 255 default: graphical
  Packages: pm: pacman pkgs: 984 Compilers: gcc: 13.2.1 Shell: Bash
    v: 5.2.26 running-in: xfce4-terminal inxi: 3.3.33
[alnone@alnone-inspiron3583 ~]$