Cannot install appimagelauncher from AUR

I recently installed EndeavourOS after using Manjaro for a few months. I do not have much experience downloading packages from the AUR and when I tried to download appimagelauncher, with the command yay -S appimagelauncher it gives me the following error

/usr/bin/lrelease: error while loading shared libraries: cannot open shared object file: No such file or directory
make[2]: *** [i18n/CMakeFiles/l10n.dir/build.make:70: l10n] Error 127
make[1]: *** [CMakeFiles/Makefile2:2055: i18n/CMakeFiles/l10n.dir/all] Error 2
make: *** [Makefile:156: all] Error 2
==> ERROR: A failure occurred in build().
error making: appimagelauncher

Can somebody help me make sense of what this error message means and how to fix it please?

Make sure your system is fully updated before the AUR build. It looks like you may have a partially updated system.

In general, always make sure your system is up-to-date before installing software.

Also, welcome to the forum!


i just updated all packages and that fixed the issue. Thanks for the advice!


Hi Murf
Welcome to the forum. Thanks for giving EndeavourOS a try. I hope you enjoy your time here.


1 Like

Welcome to the community :beers:

1 Like

This topic was automatically closed 2 days after the last reply. New replies are no longer allowed.